program: Gaussian 09
title: 000035407
version: EM64L-G09RevD.01
frameworkgroup: C1[X(C23H16N2)]
method: RPBEPBE
basis: SDD
operation: Freq
keyword: #pfreq=noraman
keyword: PBEPBE/SDD
title: #p freq=noraman PBEPBE/SDD
converged: YES YES NO NO
title: Mulliken charges:
elementType: N N C C C C C C C C C C C C C C C C C C C C C C C H H H H H H H H H H H H H H H H
charge: -0.035122 -0.050504 0.371440 -0.724879 0.222154 0.219569 -0.102979 -0.099768 0.169575 -0.377895 -0.371883 -0.317794 -0.318435 -0.315695 -0.101469 0.433276 -0.306159 -0.279434 -0.278207 -0.233085 -0.235104 -0.330537 -0.391578 -0.222309 -0.250022 0.236222 0.271206 0.277700 0.227516 0.252747 0.265400 0.267284 0.243767 0.228972 0.228092 0.231520 0.232908 0.263526 0.235669 0.233084 0.231231
chargesum: 0.00000
title: Mulliken charges with hydrogens summed into heavy atoms:
elementType: N N C C C C C C C C C C C C C C C C C C C C C C C
charge: -0.035122 -0.050504 0.371440 -0.217451 0.222154 0.219569 -0.102979 -0.099768 0.169575 -0.100195 -0.144366 -0.065048 -0.053035 -0.048412 -0.101469 0.433276 -0.062392 -0.050462 -0.050115 -0.001565 -0.002196 -0.067011 -0.155909 0.010775 -0.018791
polarizability: 3.67008239e+02 -5.89588727e+01 3.16605046e+02 -1.61374888e+01 5.34743171e+00 1.61875350e+02
1716.lowfreq: -2.7045 -0.0006 -0.0003 0.0004 4.5648 6.2631 22.9962 28.0838 39.6685
frequency: 22.9351 28.0368 39.6023 80.9313 103.5277 114.1935 152.2649 161.2092 175.9292 239.0450 242.4077 286.0942 309.4148 351.3236 394.6255 397.6792 405.1713 418.8523 435.7873 472.2346 482.3011 483.1148 503.4752 510.7991 519.5218 545.9900 549.3973 585.9648 600.3750 615.6018 630.9811 642.2252 663.3046 692.3700 733.0259 753.0016 754.0012 763.3130 774.5854 781.9903 798.2871 808.5657 818.9441 835.1620 849.1961 873.6852 875.4920 887.1868 889.4842 898.3870 933.2944 964.5913 966.8720 976.6185 979.7364 988.2005 995.4088 997.0153 999.4218 1017.0772 1019.5281 1024.9364 1039.9073 1110.5844 1111.5455 1145.3881 1148.9886 1156.5763 1166.0193 1168.1992 1185.1999 1220.6368 1233.1582 1238.7114 1253.6008 1266.0755 1276.4913 1287.3162 1303.4913 1307.3961 1337.8763 1362.9738 1368.1933 1395.6639 1406.1242 1421.1037 1425.0762 1445.2515 1454.8703 1459.7452 1474.8689 1497.4172 1504.7457 1526.8788 1543.9535 1551.9523 1554.1998 1594.4278 1610.2498 1625.1724 1632.9312 3022.3818 3076.3009 3122.0905 3127.3255 3128.9083 3129.4619 3137.5132 3139.9865 3142.0830 3155.1105 3155.5871 3156.9289 3160.0380 3169.8729 3170.1804 3170.8175
redmass: 5.0133 5.3451 5.0778 4.8855 5.1911 3.8404 5.0589 5.9398 4.1864 4.6849 4.8170 5.2010 5.7985 3.0214 4.9583 3.8872 3.9715 3.5978 3.8566 4.1141 2.9344 3.2793 3.2651 4.9582 5.9756 5.2502 3.9508 3.7530 6.8121 6.9771 4.9691 5.7022 4.8703 4.9452 2.1500 3.6646 4.3729 1.3480 1.4825 1.6385 2.8843 2.9946 3.0850 2.6857 1.9804 3.2265 1.9486 1.8649 1.8381 5.2676 4.1723 1.3594 1.3630 1.4690 2.2354 1.4628 1.3273 1.3370 1.3222 2.1735 2.3019 1.9993 4.8747 2.0465 1.8368 1.3392 1.2814 1.2552 1.1428 1.1284 1.1814 1.9369 1.4301 2.1905 2.4924 1.9159 1.9806 1.7768 3.8792 1.9748 3.9008 2.8225 2.4846 2.6878 4.9639 2.2653 6.5001 2.5625 3.0551 3.0736 1.7002 1.6257 2.9289 7.0820 6.7486 7.2433 7.4739 6.3519 5.7809 6.6639 6.2784 1.0600 1.0999 1.0872 1.0847 1.0888 1.0855 1.0890 1.0890 1.0894 1.0947 1.0953 1.0962 1.0970 1.0998 1.0996 1.0997
irintensity: 0.3265 0.1325 0.9866 1.9984 1.4374 0.4042 1.4420 0.8247 5.4494 0.1248 3.2158 0.5097 0.9688 2.0058 3.3026 0.8604 3.6930 7.2554 1.2298 2.0725 0.7452 7.0857 0.1818 4.1432 1.0760 1.1489 5.8038 1.6831 6.1835 0.9899 7.5718 2.7246 0.1827 0.2365 29.6488 0.7319 1.0913 75.1550 29.7648 107.6479 3.5989 4.1386 10.3580 30.3450 29.2467 1.0076 1.8819 0.3040 2.8330 0.0794 0.4211 2.3355 2.1906 5.7669 5.5825 2.0395 0.4718 0.0715 0.1456 6.2523 1.7112 11.0335 1.8742 0.8688 9.0415 9.7525 1.4013 3.2470 3.3380 0.9596 2.1450 10.6405 0.9878 7.4870 0.5659 5.5182 10.4046 1.6353 4.0924 5.5637 15.5188 9.8548 5.7800 1.4328 5.8505 23.5133 37.9401 18.5971 1.7235 5.8690 7.2186 19.0451 50.6547 33.0035 14.0344 24.8655 2.7895 49.1423 4.6815 12.5651 3.0338 15.6141 3.9315 3.1155 0.8225 6.4726 6.7724 10.3966 18.4912 4.7702 25.1814 26.9083 12.7089 9.6854 23.9628 50.8317 12.5493
temp: 298.150 k
press: 1.00000 atm
elementType: 7 7 6 6 6 6 6 6 6 6 6 6 6 6 6 6 6 6 6 6 6 6 6 6 6 1 1 1 1 1 1 1 1 1 1 1 1 1 1 1 1
symmnumber: 1
zpe: 842118.6 jmol-1
zpe.correction: 0.320746 hartree
zpe.thermalcorrener: 0.338827 hartree
zpe.thermalcorrenthalpy: 0.339771 hartree
zpe.thermalcorrgfe: 0.273435 hartree
zpe.sumelectzpe: -993.909789 hartree
zpe.sumelectthermal: -993.891708 hartree
zpe.sumelectthermalent: -993.890764 hartree
zpe.sumelectthermalfe: -993.957099 hartree
dipole: -2.6018 -1.9016 -0.4933
dipole: 3.2601
quadrupole: -134.6629 -127.1116 -144.7863
quadrupole: -7.4835 4.4844 2.7608
quadrupole: 0.8574 8.4086 -9.2660 -7.4835 4.4844 2.7608
hfenergy: -994.2305349 hartree
pointgroup: C01 [X(C23H16N2)]
dipole: 1.2316572 -0.3577047 0.0153987 debye
polarizability: 319.2380128|64.3496924|358.33748|-12.3123764|28.0117765|167.9131417 unknown
InChI: InChI=1S/C23H16N2/c1-4-10-21-16(7-1)13-14-17(24-21)15-20-18-8-2-5-11-22(18)25-23-12-6-3-9-19(20)23/h1-14H,15H2
charge 0 multiplicity 1
41 atoms
N  -3.586953 -0.652499 0.895498
N  1.995153 1.067281 -1.147276
C  -1.264179 -0.346515 -0.813455
C  -0.052278 -0.151697 -1.71793
C  -1.786379 0.764977 -0.080535
C  -1.902237 -1.61822 -0.670667
C  -2.961641 0.559686 0.762945
C  -3.073371 -1.715839 0.203255
C  1.272317 -0.056315 -0.960126
C  -1.2061 2.084676 -0.131913
C  -1.460683 -2.821198 -1.335373
C  1.709074 -1.127274 -0.104371
C  -3.506404 1.671153 1.497365
C  -3.736994 -2.984679 0.358077
C  3.218088 1.187506 -0.49503
C  3.735406 0.153508 0.377733
C  2.931352 -1.020198 0.556012
C  -1.759368 3.135233 0.594849
C  -2.125512 -4.031187 -1.159926
C  -2.921766 2.930277 1.415718
C  -3.277973 -4.116723 -0.305003
C  3.985356 2.377599 -0.698894
C  5.002411 0.344865 1.016555
C  5.219979 2.5379 -0.063171
C  5.732368 1.516577 0.799863
H  0.01357 -0.974076 -2.450958
H  -0.153858 0.778107 -2.302019
H  -0.308528 2.258138 -0.734387
H  -0.585864 -2.789847 -1.99322
H  1.071581 -2.00732 0.024768
H  -4.389133 1.475704 2.11375
H  -4.609683 -3.008636 1.017813
H  3.285437 -1.8229 1.213668
H  -1.303961 4.130491 0.545437
H  -1.770377 -4.929313 -1.677358
H  -3.341662 3.771802 1.977877
H  -3.789717 -5.077347 -0.180955
H  3.57358 3.143071 -1.363818
H  5.39137 -0.439186 1.677617
H  5.804244 3.450697 -0.223299
H  6.701438 1.660122 1.290082
