program: Gaussian 09
title: 000000612
version: EM64L-G09RevD.01
frameworkgroup: C1[X(C3H6O3)]
method: RPBEPBE
basis: SDD
operation: Freq
keyword: #p
keyword: freq=noraman
keyword: PBEPBE/SDD
title: #p freq=noraman PBEPBE/SDD
converged: YES YES NO NO
title: Mulliken charges:
elementType: O O O C C C H H H H H H
charge: -0.450696 -0.401986 -0.245834 -0.097044 -0.658071 0.159782 0.248914 0.221040 0.249488 0.228479 0.358880 0.387049
chargesum: 0.00000
title: Mulliken charges with hydrogens summed into heavy atoms:
elementType: O O O C C C
charge: -0.091816 -0.014937 -0.245834 0.151870 0.040936 0.159782
polarizability: 4.75136190e+01 1.97097135e-01 4.64953786e+01 1.38778884e+00 -4.50746292e+00 3.27208805e+01
1716.lowfreq: -8.6708 -6.8111 -0.0009 -0.0006 0.0007 10.2859 50.4735 216.3674 223.6825
frequency: 50.4433 216.3669 223.6792 281.2976 319.2988 368.1481 467.1902 575.5788 607.2550 700.5065 771.9901 899.9275 1015.6654 1048.3056 1076.0985 1116.7317 1232.7464 1284.6096 1308.9725 1378.7585 1391.9030 1464.2620 1474.3147 1646.1134 2996.2803 3039.5069 3101.3873 3111.6637 3491.9052 3512.6828
redmass: 5.9702 3.0005 1.0952 2.8795 1.3981 3.4038 3.5265 1.8487 2.0839 3.7221 2.7181 2.4105 1.9810 2.5723 2.7092 1.6182 1.3347 1.7463 1.2865 1.2217 1.4587 1.0689 1.0550 8.7633 1.0345 1.0851 1.1008 1.1008 1.0653 1.0642
irintensity: 6.8200 12.5437 0.2731 25.5572 112.7524 13.7363 16.2057 76.5000 59.7605 55.8234 30.1896 4.9445 114.7157 255.1317 15.3708 2.2871 15.7660 70.2606 15.2721 11.1623 15.9688 15.3282 14.0214 218.4163 14.1190 14.5032 29.7758 15.3128 23.4430 26.1933
temp: 298.150 k
press: 1.00000 atm
elementType: 8 8 8 6 6 6 1 1 1 1 1 1
symmnumber: 1
zpe: 240291.4 jmol-1
zpe.correction: 0.091522 hartree
zpe.thermalcorrener: 0.098447 hartree
zpe.thermalcorrenthalpy: 0.099391 hartree
zpe.thermalcorrgfe: 0.060651 hartree
zpe.sumelectzpe: -343.097372 hartree
zpe.sumelectthermal: -343.090447 hartree
zpe.sumelectthermalent: -343.089503 hartree
zpe.sumelectthermalfe: -343.128243 hartree
dipole: 1.5797 2.0369 0.4611
dipole: 2.6185
quadrupole: -33.8592 -38.0622 -36.0527
quadrupole: 0.0755 -1.9193 0.1427
quadrupole: 2.1322 -2.0708 -0.0613 0.0755 -1.9193 0.1427
hfenergy: -343.188894 hartree
pointgroup: C01 [X(C3H6O3)]
dipole: 0.5785585 -0.8023992 -0.2876847 debye
dipolederiv: -0.4667551 0.1608794 -0.1219709 0.087589 -0.7166928 -0.1613663 -0.1393901 -0.1335327 -0.4241881 -0.6809721 0.5137276 -0.1530611 0.451955 -0.8413218 0.0729754 -0.1001134 0.0406082 -0.3926298 -0.6623253 -0.1937174 0.0973811 0.0472285 -0.9066142 0.1445091 0.0716755 0.2535166 -0.3779875 0.0452801 -0.1636593 0.0782195 -0.2452569 0.562066 0.1208627 0.0870861 0.0661813 0.3452011 -0.0397584 -0.0641645 -0.0438415 0.0465462 -0.0289807 -0.0793373 0.0455858 -0.086703 -0.0201218 1.1518572 -0.1008962 -0.0590093 -0.2779122 1.3229941 -0.3315689 -0.1231337 -0.397312 0.2884154 0.0625941 0.0250227 -0.017164 0.032171 -0.0018294 0.0479334 -0.0327702 0.0684185 -0.0797037 0.0973019 -0.0352959 0.0205401 -0.0136017 0.0414879 0.098534 -0.0146346 0.0455043 -0.1085724 -0.1130689 -0.05201 0.0381174 -0.0458129 0.0971322 -0.0079397 0.037027 -0.0134268 0.0764999 0.0667229 0.1008339 -0.0136848 0.0752459 -0.097626 -0.0194956 -0.0106873 0.002174 0.0911432 0.3514666 -0.1244838 0.09823 -0.0444922 0.2871806 0.0547484 0.0826061 0.0964235 0.2408689 0.1876569 -0.0662365 0.0762435 -0.1136598 0.2822042 0.0601448 0.0967488 0.0581482 0.3610747 unknown
polarizability: 47.4111605|-0.1244308|47.3383626|-1.9648935|-2.7703698|31.980355 unknown
InChI: InChI=1S/C3H6O3/c1-2(4)3(5)6/h2,4-5H,1H3
charge 0 multiplicity 1
12 atoms
O  -1.422882 1.096144 0.616427
O  1.541122 -1.042667 0.316352
O  1.164695 1.159485 -0.334422
C  -0.716732 -0.176627 0.523309
C  -1.397482 -1.128917 -0.488735
C  0.73861 0.076276 0.130461
H  -0.735584 -0.633065 1.528948
H  -1.34709 -0.717198 -1.51219
H  -2.458787 -1.230288 -0.20844
H  -0.922341 -2.125239 -0.475318
H  -0.924624 1.768145 0.076417
H  2.473294 -0.847049 0.02599
