program: Gaussian 09
title: 000035509
version: EM64L-G09RevD.01
frameworkgroup: C1[X(C27H21N3)]
method: RPBEPBE
basis: SDD
operation: Freq
keyword: #pfreq=noraman
keyword: PBEPBE/SDD
title: #p freq=noraman PBEPBE/SDD
converged: YES YES NO NO
title: Mulliken charges:
elementType: N N N C C C C C C C C C C C C C C C C C C C C C C C C C C C H H H H H H H H H H H H H H H H H H H H H
charge: -0.063876 -0.090947 -0.481868 -0.284652 0.453946 0.493034 0.099441 0.106008 -0.367179 -0.368071 -0.431520 -0.408155 0.295525 0.298651 -0.236430 -0.232576 -0.230866 -0.235490 -0.246810 -0.247963 -0.351716 -0.354146 -0.383315 -0.368904 -0.229684 -0.232906 -0.238818 -0.243107 -0.229490 -0.229934 0.318629 0.248808 0.256561 0.280821 0.246933 0.218742 0.221774 0.219927 0.221922 0.222299 0.225484 0.273093 0.273867 0.216113 0.207276 0.232058 0.232217 0.229276 0.229516 0.232960 0.233542
chargesum: 0.00000
title: Mulliken charges with hydrogens summed into heavy atoms:
elementType: N N N C C C C C C C C C C C C C C C C C C C C C C C C C C C
charge: -0.063876 -0.090947 -0.163239 -0.284652 0.453946 0.493034 0.099441 0.106008 -0.118371 -0.111510 -0.150699 -0.161222 0.295525 0.298651 -0.017688 -0.010802 -0.010939 -0.013567 -0.024512 -0.022479 -0.078623 -0.080280 -0.167202 -0.161628 0.002374 -0.000689 -0.009542 -0.013591 0.003470 0.003608
polarizability: 3.62188589e+02 7.46258145e+00 3.55820467e+02 2.19095893e-01 -1.32138100e+01 2.28640523e+02
1716.lowfreq: -7.0611 -4.1393 -0.0004 0.0005 0.0006 2.3604 15.3659 22.9828 27.8082
frequency: 14.1547 22.9322 27.7888 31.6621 35.8042 38.6212 50.3919 59.8493 69.6696 90.2162 143.2887 160.7876 195.3175 221.2857 233.7357 239.8089 254.4427 262.8774 284.7950 330.8232 360.9797 395.6692 400.7999 402.0648 403.4164 405.8183 408.3703 456.8151 481.0492 492.5596 521.8945 534.3619 587.6816 613.2689 614.2244 615.0488 616.0737 619.9870 628.3983 634.3814 657.4789 667.4511 696.4508 697.9511 701.5981 705.0732 708.8424 743.7184 759.2738 778.5837 781.5607 791.2101 812.4925 850.5319 851.8305 853.7360 856.8762 890.9454 903.4252 922.0213 930.3056 931.7103 938.4329 957.3609 977.1086 981.3077 981.7888 982.6434 989.1982 989.5552 989.9361 990.8914 993.7956 998.7329 1004.0446 1004.4148 1012.4962 1022.9611 1025.9534 1027.4636 1041.6441 1063.2078 1077.8821 1080.6281 1085.5787 1094.5616 1134.8304 1165.7177 1168.0947 1170.9177 1173.5018 1174.0009 1178.4140 1187.8201 1189.1204 1191.5498 1211.2185 1252.5881 1307.6235 1313.7793 1314.6533 1316.5506 1337.5152 1378.2479 1381.8943 1384.3662 1385.6343 1404.2498 1431.7235 1434.1797 1436.1048 1439.2704 1475.0896 1477.4297 1481.1913 1487.8320 1572.4133 1583.4330 1590.2764 1591.4151 1599.1643 1605.9718 1611.4208 1613.3718 1613.9965 1632.4836 3113.9035 3117.9972 3118.2235 3120.6673 3130.0656 3131.0075 3132.3250 3132.5774 3145.5364 3145.6982 3146.4522 3147.5393 3155.7242 3159.4337 3159.7119 3160.1702 3165.1256 3166.7668 3170.6795 3171.6416 3582.8224
redmass: 4.0125 4.0877 3.9809 4.1185 4.7211 4.7215 5.1095 5.1260 5.1425 5.4066 5.0011 4.9565 4.8491 4.9639 4.7523 5.9753 5.4526 5.2902 4.9099 6.6913 5.8925 4.8200 2.8652 3.3090 2.8725 3.1251 4.8680 4.0584 3.8254 3.8299 3.6823 1.1602 5.7253 6.0501 6.4328 6.3846 6.3971 6.6546 7.6075 5.9364 5.2803 6.3269 2.7345 1.8179 1.7096 1.7951 2.1056 3.6968 1.8783 2.2994 2.1338 2.5964 6.1441 1.2545 1.2493 1.2571 1.2580 4.4009 2.9083 1.9428 1.4567 1.4542 1.9136 4.2808 1.3943 1.3821 1.4306 1.4207 5.2820 5.3273 5.4363 5.7918 1.3532 1.3374 1.3393 1.3424 4.9280 2.5621 2.2080 2.1215 2.2865 2.8724 1.5722 1.5822 1.5883 1.8598 2.7892 2.9315 1.0741 1.0586 1.0665 1.0698 1.1379 1.1311 1.1815 1.1230 3.7867 2.2275 1.3349 1.3564 1.3637 1.3640 3.8196 7.1477 9.2704 9.0069 8.9985 2.7103 2.2021 2.2344 2.2675 2.2804 2.1853 2.2794 2.3863 2.5178 5.2956 6.2771 6.1886 6.2836 6.0368 6.0833 6.1811 6.0590 6.1405 11.3149 1.0879 1.0870 1.0845 1.0844 1.0891 1.0884 1.0868 1.0870 1.0922 1.0922 1.0927 1.0941 1.0948 1.0956 1.0947 1.0961 1.1001 1.0986 1.1003 1.0998 1.0779
irintensity: 0.3656 0.3019 0.4704 0.1684 0.4243 0.3230 0.3878 0.5327 0.1103 1.4489 0.2897 2.9447 2.4995 1.7972 0.8893 0.8648 0.0962 0.1011 0.7405 10.7496 2.9854 5.3663 0.5162 0.2802 0.2593 0.5901 0.3417 1.8633 5.1398 4.0650 7.1500 101.2782 1.8585 17.3634 0.4991 1.1037 0.8936 15.1003 10.9405 6.3985 4.9359 4.3995 20.2351 0.7111 30.0433 50.4974 167.1048 20.0043 55.1480 42.9472 4.3633 39.7119 1.1244 1.1509 0.2459 1.0601 0.2118 26.9679 20.0268 7.0433 0.8405 3.2907 4.0492 13.5415 0.3135 0.4556 2.4360 1.0290 0.2445 0.2583 0.5356 0.2254 0.0908 1.0359 1.7707 1.5741 2.0347 19.0803 23.8482 11.3618 3.7729 2.7937 16.2825 15.9094 3.1086 11.7013 12.9737 29.2015 2.1440 0.1476 1.3367 1.0592 21.9633 19.3097 3.2546 2.7343 30.1461 55.5614 0.6471 2.3467 0.2752 1.0077 5.5928 33.3950 1.3453 4.5899 0.7127 294.9678 4.8233 16.4734 3.0728 135.6953 23.8483 16.7789 2.0766 19.9437 55.3587 52.9079 2.1860 3.7054 25.4423 5.2800 4.6760 3.6880 5.2262 269.0858 13.0769 14.2212 0.1880 0.4333 17.1843 9.9550 0.8210 1.3747 23.2891 22.0125 24.7543 41.0534 26.8902 19.1041 17.0252 23.9060 21.3537 17.8441 22.5789 17.2855 22.9023
temp: 298.150 k
press: 1.00000 atm
elementType: 7 7 7 6 6 6 6 6 6 6 6 6 6 6 6 6 6 6 6 6 6 6 6 6 6 6 6 6 6 6 1 1 1 1 1 1 1 1 1 1 1 1 1 1 1 1 1 1 1 1 1
symmnumber: 1
zpe: 1056535.2 jmol-1
zpe.correction: 0.402413 hartree
zpe.thermalcorrener: 0.426500 hartree
zpe.thermalcorrenthalpy: 0.427444 hartree
zpe.thermalcorrgfe: 0.344701 hartree
zpe.sumelectzpe: -1203.692690 hartree
zpe.sumelectthermal: -1203.668603 hartree
zpe.sumelectthermalent: -1203.667659 hartree
zpe.sumelectthermalfe: -1203.750401 hartree
dipole: -4.1287 1.2796 1.1983
dipole: 4.4855
quadrupole: -150.4676 -150.3678 -176.1955
quadrupole: 2.8838 1.6450 -3.4684
quadrupole: 8.5427 8.6425 -17.1852 2.8838 1.6450 -3.4684
hfenergy: -1204.0951026 hartree
pointgroup: C01 [X(C27H21N3)]
dipole: -1.6212627 0.0487215 0.6952909 debye
polarizability: 356.5878086|6.3760552|360.2954488|-13.5257783|-12.6197002|229.7663216 unknown
InChI: InChI=1S/C27H21N3/c1-5-13-21(14-6-1)25-28-26(22-15-7-2-8-16-22)30-27(29-25,23-17-9-3-10-18-23)24-19-11-4-12-20-24/h1-20,28H
charge 0 multiplicity 1
51 atoms
N  0.252639 1.231397 -0.400055
N  0.246166 -1.30474 -0.312688
N  -1.653419 -0.008914 0.314902
C  1.053777 -0.041419 -0.294067
C  2.044109 -0.109525 -1.477895
C  1.834366 0.060507 1.048608
C  -1.002658 1.196913 -0.029239
C  -1.018132 -1.236661 0.025928
C  2.783369 -1.299537 -1.689142
C  2.806039 1.083762 1.19793
C  2.251527 0.995659 -2.334622
C  1.574813 -0.803627 2.137945
C  -1.815911 2.445668 0.017363
C  -1.85042 -2.473869 0.09568
C  3.722964 -1.379577 -2.738365
C  3.499227 1.242058 2.415722
C  3.190962 0.91417 -3.389302
C  2.275703 -0.650299 3.357036
C  3.932244 -0.271071 -3.593872
C  3.236901 0.374024 3.5029
C  -1.150858 3.686942 0.196021
C  -1.196071 -3.729305 0.203946
C  -3.230002 2.431208 -0.115478
C  -3.269638 -2.438103 0.053801
C  -1.885707 4.887901 0.250974
C  -1.943797 -4.920595 0.280899
C  -3.964907 3.635948 -0.059926
C  -4.018211 -3.63319 0.132297
C  -3.296144 4.867075 0.127321
C  -3.35884 -4.877516 0.250595
H  -2.5802 0.010311 0.735582
H  2.606396 -2.159076 -1.035065
H  3.019158 1.746405 0.352665
H  1.66427 1.903928 -2.170546
H  0.842257 -1.60928 2.030635
H  4.289916 -2.304987 -2.893056
H  4.247707 2.036365 2.517269
H  3.341157 1.775621 -4.050606
H  2.070096 -1.331749 4.190725
H  4.660884 -0.333718 -4.410453
H  3.778751 0.493207 4.448076
H  -0.060544 3.67905 0.28946
H  -0.101818 -3.739527 0.21461
H  -3.763479 1.491887 -0.307241
H  -3.804534 -1.490004 -0.081517
H  -1.363133 5.839887 0.394607
H  -1.427339 -5.88287 0.366138
H  -5.054338 3.615192 -0.173089
H  -5.112163 -3.593876 0.090776
H  -3.86709 5.801026 0.172646
H  -3.940242 -5.803974 0.312666
