program: Gaussian 09
title: 000035314
version: EM64L-G09RevD.01
frameworkgroup: C1[X(C12H17Cl2N)]
method: RPBEPBE
basis: SDD
operation: Freq
keyword: #p
keyword: freq=noraman
keyword: PBEPBE/SDD
title: #p freq=noraman PBEPBE/SDD
converged: YES YES NO NO
title: Mulliken charges:
elementType: Cl Cl N C C C C C C C C C C C C H H H H H H H H H H H H H H H H H
charge: -0.069918 -0.074253 -0.137689 -0.510549 -0.327699 -0.324270 0.298565 0.265221 -0.587894 -0.575579 -0.359567 -0.401595 -0.830802 -0.245921 -0.237396 0.234639 0.226374 0.255623 0.229586 0.232031 0.234196 0.277972 0.261515 0.268474 0.266789 0.251783 0.230429 0.230448 0.230330 0.232520 0.228303 0.228336
chargesum: 0.00000
title: Mulliken charges with hydrogens summed into heavy atoms:
elementType: Cl Cl N C C C C C C C C C C C C
charge: -0.069918 -0.074253 -0.137689 -0.049536 0.157510 0.141957 0.298565 0.265221 -0.048407 -0.040317 -0.107784 -0.171167 -0.137504 -0.017618 -0.009060
polarizability: 1.86190511e+02 6.27756852e+00 1.39490057e+02 -3.85128916e+00 -1.19774387e+01 1.37410994e+02
1716.lowfreq: -11.1254 -4.2091 -0.0020 -0.0010 0.0012 4.7431 17.4600 25.3929 33.6395
frequency: 17.3411 25.2086 33.5707 40.7039 76.9679 90.8677 120.5883 154.1384 164.1279 173.8180 194.1565 204.6238 247.8850 270.0758 283.6001 369.7666 396.2140 417.0968 443.1933 490.3987 510.8749 527.1586 608.3123 664.9713 673.1775 717.8798 758.3230 767.9552 773.2455 780.0128 811.6472 851.0970 883.0345 943.7445 977.1429 985.6842 997.6096 1000.3652 1004.3885 1042.0345 1044.6267 1062.4559 1063.5974 1083.5044 1108.3632 1119.3686 1171.6731 1177.5474 1186.1359 1225.3406 1230.9796 1247.3150 1253.2759 1272.6335 1277.0411 1297.1459 1303.1903 1350.4085 1360.7615 1370.7857 1387.8720 1402.1446 1433.8454 1450.1852 1452.1665 1462.2192 1472.2765 1475.4284 1479.5273 1481.6159 1483.7610 1588.1725 1615.9050 2896.2162 2929.0530 2941.5946 2969.6973 2986.6280 3043.4828 3054.4520 3056.4157 3060.7816 3065.8552 3083.6661 3118.2433 3129.0690 3143.7307 3147.0546 3147.7619 3160.8226
redmass: 4.4285 5.7771 8.7172 6.1895 2.3255 2.7549 2.9277 3.6796 1.2753 2.1670 4.6130 5.3953 3.0145 3.5472 2.6449 4.0206 2.6431 3.7540 3.1196 3.3523 3.6492 4.2296 5.7600 6.1790 6.2333 3.3251 1.3551 2.2999 1.2795 1.1512 4.2245 4.1241 1.2883 1.5387 1.6573 1.5877 1.4794 1.4749 1.4333 1.5777 2.0635 3.0390 3.0201 2.0185 1.7613 1.7236 1.0636 1.5330 1.8881 2.0957 1.8723 1.1619 1.3112 1.4268 1.2296 1.3251 1.3107 1.9473 1.3291 1.4787 2.0805 1.3344 2.0311 1.0945 1.1003 1.1459 1.1873 1.1719 1.1439 1.0760 1.6724 6.4616 6.3487 1.0677 1.0692 1.0689 1.0384 1.0896 1.0970 1.0898 1.0639 1.0602 1.0855 1.0978 1.0862 1.0882 1.0935 1.1115 1.1114 1.1006
irintensity: 0.0367 0.6017 1.0297 0.8143 3.0212 1.0955 0.2374 4.5178 1.5913 0.3993 6.4091 0.5809 5.3659 2.7140 1.2246 11.6891 1.6399 2.6316 9.0709 2.8540 1.7915 0.6589 1.0840 99.2308 79.3019 2.4863 62.4676 14.3880 7.0251 7.1861 4.1251 6.4543 0.5773 6.8140 12.7193 2.2288 13.0458 6.1828 5.3392 4.8366 8.9004 1.2047 19.5862 26.8129 31.6857 12.8043 2.2813 8.2276 2.4944 3.5372 28.9646 11.6891 16.9394 0.8341 9.0311 12.0913 7.9449 9.3272 0.5114 1.0030 6.1159 10.1638 2.5187 4.8871 8.2136 20.1184 26.5300 2.1743 15.2214 1.8459 26.3512 0.3081 4.2373 52.1251 42.0041 59.0473 31.6871 18.8268 20.8765 11.0935 11.5899 22.7290 18.7495 25.7479 8.1899 6.5056 30.6229 12.9313 17.2565 30.2544
temp: 298.150 k
press: 1.00000 atm
elementType: 17 17 7 6 6 6 6 6 6 6 6 6 6 6 6 1 1 1 1 1 1 1 1 1 1 1 1 1 1 1 1 1
symmnumber: 1
zpe: 692750.2 jmol-1
zpe.correction: 0.263855 hartree
zpe.thermalcorrener: 0.280419 hartree
zpe.thermalcorrenthalpy: 0.281364 hartree
zpe.thermalcorrgfe: 0.215823 hartree
zpe.sumelectzpe: -1441.184193 hartree
zpe.sumelectthermal: -1441.167629 hartree
zpe.sumelectthermalent: -1441.166684 hartree
zpe.sumelectthermalfe: -1441.232225 hartree
dipole: 2.3957 -1.4383 0.7823
dipole: 2.9017
quadrupole: -110.4730 -121.9925 -98.8216
quadrupole: -5.6812 0.6606 -5.0453
quadrupole: -0.0440 -11.5635 11.6074 -5.6812 0.6606 -5.0453
hfenergy: -1441.4480479 hartree
pointgroup: C01[X(C12H17Cl2N1)]
dipole: 0.9231037 -0.5220982 0.4225891 debye
polarizability: 185.6411478|9.7224049|140.0706769|2.4516153|-11.0650049|137.3797365 unknown
InChI: InChI=1S/C12H17Cl2N/c1-11-4-2-3-5-12(11)10-15(8-6-13)9-7-14/h2-5H,6-10H2,1H3
charge 0 multiplicity 1
32 atoms
Cl -1.985976 4.095112 -0.00246
Cl -4.505991 -2.465807 -0.934416
N  -1.378138 -0.002314 0.230965
C  -0.261483 -0.790736 0.805405
C  -1.390482 1.425185 0.626588
C  -2.690409 -0.685637 0.273335
C  1.108685 -0.46472 0.207321
C  2.300689 -0.691568 0.960378
C  -1.868585 2.286309 -0.550127
C  -2.87445 -1.502302 -1.013571
C  1.204875 0.015309 -1.121549
C  3.551744 -0.417227 0.351457
C  2.260581 -1.222781 2.385722
C  2.457625 0.282082 -1.714942
C  3.639863 0.067247 -0.972608
H  -0.482842 -1.861786 0.620923
H  -0.225766 -0.675633 1.914262
H  -0.362073 1.727313 0.889362
H  -2.032715 1.614771 1.516101
H  -3.500145 0.062179 0.345295
H  -2.791478 -1.352328 1.157842
H  -1.155895 2.265554 -1.386354
H  -2.880519 2.021994 -0.892851
H  -2.943651 -0.85936 -1.902611
H  -2.089799 -2.26213 -1.147765
H  0.27602 0.173041 -1.68041
H  4.469732 -0.588041 0.927044
H  1.738143 -0.527123 3.071032
H  1.736664 -2.195058 2.452654
H  3.281954 -1.367994 2.776347
H  2.510361 0.652649 -2.744803
H  4.61986 0.272498 -1.417666
