program: Gaussian 09
title: 000035380
version: EM64L-G09RevD.01
frameworkgroup: C1[X(C19H20ClNO5)]
method: RPBEPBE
basis: SDD
operation: Freq
keyword: #p
keyword: freq=noraman
keyword: PBEPBE/SDD
title: #p freq=noraman PBEPBE/SDD
converged: YES YES NO NO
title: Mulliken charges:
elementType: Cl O O O O O N C C C C C C C C C C C C C C C C C C C H H H H H H H H H H H H H H H H H H H H
charge: -0.061405 -0.266080 -0.274769 -0.259166 -0.417144 -0.231969 -0.237448 -0.393467 -0.351683 0.275884 -0.482832 0.099477 0.277638 -0.349326 0.303158 -0.495723 -0.374860 0.329524 0.174222 -0.365860 -0.311570 -0.222108 -0.229233 -0.103215 -0.533786 -0.537896 0.211931 0.246687 0.229122 0.257631 0.244662 0.262726 0.254496 0.258077 0.255587 0.272715 0.262667 0.256366 0.256201 0.252493 0.223655 0.224627 0.375414 0.221434 0.250885 0.222261
chargesum: 0.00000
title: Mulliken charges with hydrogens summed into heavy atoms:
elementType: Cl O O O O O N C C C C C C C C C C C C C C C C C C C
charge: -0.061405 -0.266080 -0.274769 -0.259166 -0.041730 -0.231969 -0.237448 0.065151 0.135069 0.275884 0.024556 0.099477 0.277638 -0.094829 0.303158 -0.237645 -0.119273 0.329524 0.174222 -0.093145 -0.048903 0.034258 0.026968 -0.103215 0.166989 0.156684
polarizability: 2.74891948e+02 1.19013016e+01 2.50278312e+02 1.83299840e+01 -1.53358304e+01 2.00624241e+02
1716.lowfreq: -3.4009 -0.0015 -0.0010 0.0007 1.8837 5.3335 15.9012 19.4185 23.0049
frequency: 15.8575 19.4111 22.9356 23.2031 34.5274 44.8892 66.2605 75.6466 81.0125 86.8504 92.2040 111.1835 115.1511 140.7130 163.2506 166.9073 181.3518 193.6028 232.5243 247.6026 249.2087 265.0885 272.4145 293.7605 300.2661 316.5763 381.0340 386.7438 406.6273 412.5599 446.1875 457.6179 469.4146 477.2039 502.3909 508.1509 518.2126 556.3238 584.0540 587.2380 621.7088 626.7091 629.8791 642.1355 688.4640 694.9968 718.1854 729.8374 741.1193 742.2789 809.7199 818.0904 826.0561 829.1640 843.9304 860.3996 881.0520 903.5511 947.6178 958.6812 974.8334 987.2536 993.4231 1002.3992 1011.5835 1020.6358 1059.4356 1071.2598 1080.0087 1090.8479 1109.9573 1111.5536 1113.3280 1115.5848 1140.8820 1151.9095 1155.1339 1168.9182 1184.2228 1188.8321 1236.4418 1238.3972 1266.0358 1277.3773 1286.3489 1287.7625 1294.4667 1304.2098 1361.8636 1362.8573 1368.5083 1379.8604 1380.2124 1390.9657 1410.2514 1432.6422 1437.4902 1443.1748 1448.4717 1466.4179 1467.6302 1469.9420 1472.6405 1473.5499 1476.3855 1503.4366 1549.1310 1584.7332 1588.7798 1595.3547 1613.0107 1668.9998 2959.3223 2963.5559 2979.4202 3001.2810 3021.2931 3040.7002 3047.7147 3054.9664 3068.1612 3094.2160 3127.8168 3132.1963 3138.2487 3155.6986 3159.7562 3174.4489 3175.7378 3178.6142 3180.3987 3511.1631
redmass: 7.8558 11.1900 9.4883 6.3097 4.2133 4.0337 4.4284 2.5742 3.6974 3.2038 4.4830 5.5913 4.0019 5.9317 3.6097 4.2171 1.6805 7.5149 1.2125 3.3202 4.6344 5.1422 2.0200 4.9538 4.8575 4.7737 4.6572 6.0816 5.0215 2.9859 4.1022 5.1958 4.2441 3.3514 2.0878 4.4701 5.2176 5.5882 4.8006 4.4146 6.4606 3.6491 4.5582 1.3741 5.3212 5.6305 4.0293 2.9365 1.6032 2.3157 1.6229 2.2387 1.7552 1.3076 1.6375 4.0636 3.1951 3.7422 1.3463 1.3749 1.3771 9.0524 5.6038 4.0580 3.5161 3.2756 3.0773 2.8670 2.2991 2.4805 1.3619 1.2599 1.2567 1.5131 2.0107 1.4052 1.4497 2.1314 1.1892 1.6622 2.3796 1.4233 1.4511 1.6462 2.5058 1.6525 1.2689 1.3717 1.5523 3.2841 5.1124 2.6146 2.0989 3.8417 2.9826 1.1599 1.0991 1.1182 1.3724 1.0884 1.0622 1.0622 1.0853 1.0702 2.4711 2.6079 8.2689 7.9269 8.2757 6.2502 6.7312 8.2497 1.0331 1.0328 1.0638 1.0608 1.0620 1.0936 1.1040 1.1045 1.1001 1.1049 1.0992 1.0995 1.0899 1.0885 1.0886 1.0968 1.0902 1.0950 1.0970 1.0639
irintensity: 0.3952 0.9937 0.2737 1.1271 1.2756 0.0627 0.8097 0.4122 1.5244 0.0150 0.5880 1.9144 12.9354 2.0209 0.3561 0.5010 2.0432 2.1037 0.0511 0.6781 5.6716 0.8359 0.4954 2.3315 4.6436 3.8386 12.6764 19.5309 3.1423 0.0900 10.2578 6.8752 6.4336 37.5435 16.9646 24.1381 18.0117 22.0645 0.3986 10.1370 1.4265 11.9909 3.6859 125.9754 9.5956 2.3202 10.1369 7.7268 15.7686 30.2804 0.2744 2.0889 80.3543 7.1908 56.3173 0.4293 13.6821 18.9388 0.0333 2.8990 0.9544 76.9680 23.8345 41.7462 45.3311 212.5058 55.4397 27.5903 51.9052 37.0437 5.1250 0.1834 0.1985 50.7475 36.4743 4.7581 9.1306 82.9879 33.1059 30.0123 96.7284 4.2613 3.2255 85.8488 124.7818 50.2355 2.1955 135.8907 32.9690 49.1692 32.9740 18.4769 51.2229 17.8925 19.3850 26.0509 12.7667 46.5201 16.3806 57.4419 23.7340 36.4897 14.4147 52.9738 25.0604 161.6735 154.5317 16.4236 74.5849 63.5740 118.8776 185.8879 43.0999 63.8335 14.3623 27.3885 14.7615 5.8480 41.5379 40.1895 1.7097 22.3457 24.4174 11.2008 7.3996 0.5146 1.5782 5.2753 5.0557 3.2206 1.4117 19.5874
temp: 298.150 k
press: 1.00000 atm
elementType: 17 8 8 8 8 8 7 6 6 6 6 6 6 6 6 6 6 6 6 6 6 6 6 6 6 6 1 1 1 1 1 1 1 1 1 1 1 1 1 1 1 1 1 1 1 1
symmnumber: 1
zpe: 929820.2 jmol-1
zpe.correction: 0.354150 hartree
zpe.thermalcorrener: 0.380339 hartree
zpe.thermalcorrenthalpy: 0.381283 hartree
zpe.thermalcorrgfe: 0.293305 hartree
zpe.sumelectzpe: -1625.035488 hartree
zpe.sumelectthermal: -1625.009299 hartree
zpe.sumelectthermalent: -1625.008355 hartree
zpe.sumelectthermalfe: -1625.096333 hartree
dipole: -1.2164 4.7491 1.6406
dipole: 5.1697
quadrupole: -163.4554 -158.7455 -144.5834
quadrupole: 6.5639 5.8911 3.9378
quadrupole: -7.8606 -3.1508 11.0114 6.5639 5.8911 3.9378
hfenergy: -1625.3896376 hartree
pointgroup: C01 [X(C19H20Cl1N1O5)]
dipole: -0.1187137 -2.0102682 -0.2855238 debye
polarizability: 275.4918508|-10.9243886|238.6412581|-19.7822629|-24.6294687|211.661393 unknown
InChI: InChI=1S/C19H20ClNO5/c1-25-15-9-10-16(17(12-15)26-2)21(11-3-4-18(22)23)19(24)13-5-7-14(20)8-6-13/h5-10,12,22H,3-4,11H2,1-2H3
charge 0 multiplicity 1
46 atoms
Cl 5.681712 2.472231 -1.513277
O  -0.171288 -0.495234 -1.498584
O  -0.944055 2.887072 -0.002738
O  1.699853 -4.39431 0.940431
O  -6.833043 0.138577 0.275318
O  -5.285071 -0.824482 -1.16075
N  -0.654247 0.772284 0.922278
C  -2.064949 0.824427 1.397555
C  -3.065745 0.348472 0.32148
C  -0.025014 -0.524572 0.885812
C  -4.511145 0.415113 0.847025
C  -0.17809 1.897718 0.235191
C  0.214542 -1.192109 -0.351029
C  0.298676 -1.195667 2.087746
C  1.271078 1.949912 -0.172239
C  0.802878 -2.481008 -0.373969
C  0.864556 -2.48214 2.087077
C  1.12294 -3.12019 0.849235
C  -5.519616 -0.158269 -0.129253
C  1.585389 2.680597 -1.346772
C  2.3263 1.406366 0.603549
C  2.921655 2.839526 -1.767298
C  3.671804 1.568411 0.204901
C  3.945968 2.272964 -0.982454
C  0.064471 -1.117368 -2.803749
C  1.986255 -5.108064 -0.306266
H  -2.142678 0.191599 2.301671
H  -2.279259 1.871647 1.67291
H  -2.828112 -0.685049 0.011553
H  -2.957667 0.986452 -0.572441
H  -4.616398 -0.152636 1.794899
H  -4.811173 1.453364 1.083159
H  0.111615 -0.682944 3.038019
H  0.994256 -2.977142 -1.328115
H  1.119263 -3.000421 3.01504
H  0.767783 3.135031 -1.914604
H  2.111654 0.867578 1.530039
H  3.162714 3.397004 -2.676884
H  4.486376 1.158012 0.80838
H  -0.320383 -0.393424 -3.535967
H  1.144952 -1.285464 -2.975836
H  -0.489251 -2.071377 -2.89796
H  -7.472052 -0.264136 -0.373828
H  1.060206 -5.297962 -0.883323
H  2.428967 -6.064743 0.006634
H  2.710074 -4.550548 -0.93227
