program: Gaussian 09
title: 000035282
version: EM64L-G09RevD.01
frameworkgroup: C1[X(C5H8N4O)]
method: RPBEPBE
basis: SDD
operation: Freq
keyword: #pfreq=noraman
keyword: PBEPBE/SDD
title: #p freq=noraman PBEPBE/SDD
converged: NO NO NO NO
title: Mulliken charges:
elementType: O N N N N C C C C C H H H H H H H H
charge: -0.186972 -0.437878 -0.032966 -0.065168 -0.622634 -0.477027 0.234529 -0.660824 0.217194 -0.109698 0.197793 0.264633 0.311351 0.231261 0.204375 0.255451 0.360650 0.315932
chargesum: 0.00000
title: Mulliken charges with hydrogens summed into heavy atoms:
elementType: O N N N N C C C C C
charge: -0.186972 -0.126528 -0.032966 -0.065168 0.053947 -0.014601 0.234529 0.030263 0.217194 -0.109698
polarizability: 9.84831806e+01 -4.38492331e+00 1.08482327e+02 -4.46446773e+00 1.28486362e+00 4.91401696e+01
1716.lowfreq: -3.1747 0.0004 0.0007 0.0013 13.6464 16.2246 48.4527 83.6512 117.6304
frequency: 46.3694 83.4338 117.6206 190.8703 210.6336 280.7078 289.9856 303.9380 348.8974 504.1533 524.2465 537.6098 562.2311 593.0302 607.7201 675.5972 710.3666 777.4097 780.8273 833.8763 919.2936 945.8367 968.7791 1056.7914 1061.8776 1091.3031 1152.8711 1217.3901 1275.5682 1315.8175 1364.5770 1391.4600 1405.0933 1464.2088 1476.7640 1486.6515 1580.4619 1600.6844 1606.1910 1662.2722 2982.8362 2985.9911 3069.7086 3089.9359 3099.6732 3531.7857 3543.9996 3695.4921
redmass: 2.5844 5.5102 4.4914 6.8358 1.1570 1.1082 3.7796 2.1597 3.6610 5.3640 8.5068 1.1459 4.4004 1.1670 6.7260 6.5761 7.6326 1.8859 3.2146 4.1088 4.5305 2.5983 2.8428 2.6710 1.6380 2.1809 3.0995 1.7418 1.3180 1.4055 2.7983 1.4817 2.9381 1.0827 1.0490 1.0688 2.3764 7.7206 1.8887 4.6842 1.0428 1.0597 1.0972 1.0974 1.1011 1.0777 1.0465 1.1050
irintensity: 2.9932 1.5397 0.0530 0.8170 1.0163 63.6971 1.9532 2.8042 0.5691 0.8039 1.1924 296.0914 0.1885 64.8220 4.8943 9.4933 1.4863 5.9979 16.9693 1.3046 45.3268 7.6962 13.9811 5.7823 48.5563 25.2635 18.7296 77.4598 18.9960 4.7400 57.8217 45.6709 78.9680 7.1865 17.7062 10.5591 144.0228 738.2919 303.6200 248.9303 35.1975 26.2994 13.5487 25.2182 23.5124 19.7144 83.6095 44.7519
temp: 298.150 k
press: 1.00000 atm
elementType: 8 7 7 7 7 6 6 6 6 6 1 1 1 1 1 1 1 1
symmnumber: 1
zpe: 364997.6 jmol-1
zpe.correction: 0.139020 hartree
zpe.thermalcorrener: 0.148868 hartree
zpe.thermalcorrenthalpy: 0.149812 hartree
zpe.thermalcorrgfe: 0.103441 hartree
zpe.sumelectzpe: -488.818198 hartree
zpe.sumelectthermal: -488.808350 hartree
zpe.sumelectthermalent: -488.807406 hartree
zpe.sumelectthermalfe: -488.853777 hartree
dipole: 3.7036 -9.9077 -0.5759
dipole: 10.5929
quadrupole: -56.9631 -59.1498 -59.4313
quadrupole: 11.1011 -0.2684 0.0927
quadrupole: 1.5516 -0.6350 -0.9166 11.1011 -0.2684 0.0927
hfenergy: -488.9572183 hartree
pointgroup: C01 [X(C5H8N4O1)]
dipole: -1.5978714 3.8411939 -0.2465372 debye
dipolederiv: -0.6554102 0.3384441 -0.0409627 0.276358 -1.1254807 0.0502123 -0.05511 0.0733056 -0.372802 -1.0903026 -0.3291112 -0.1071999 -0.048024 -0.8286816 0.0146137 -0.1410309 -0.0421236 -0.2057893 -1.0838633 0.3157822 -0.0869189 0.2842579 -0.7229799 0.0099905 -0.1518761 0.0613522 -0.250275 -0.5804168 0.0100734 -0.0354804 -0.1630541 -1.5977217 0.0075666 -0.048637 0.0310349 -0.3061593 -0.5504912 -0.5520977 0.0576788 -0.5044055 -1.1818429 -0.0635456 0.0443129 -0.0890381 -0.7310262 -0.2062356 -0.0119133 0.0327164 0.0082608 0.1094428 -0.0544586 0.1604401 -0.0692121 0.0350738 0.9176519 0.1129275 0.039577 -0.0582789 1.0936195 0.0122595 0.0990663 0.0238145 0.0391703 0.0074057 0.0170917 0.0180215 0.0304501 0.0651513 0.0315436 -0.1167499 0.0348536 0.0286454 1.2655793 0.2218503 0.1473801 0.2962853 1.8710761 0.0002672 0.1685188 0.0043806 0.2811942 1.3287923 -0.244244 0.1481072 -0.2326216 1.8861632 -0.0596703 0.1940505 -0.0817859 0.2872965 0.0219847 -0.0027798 0.0063075 0.0516682 -0.0838336 0.1567996 -0.0208062 0.1032437 -0.0083631 0.0679488 0.0003391 -0.0056786 -0.0421279 -0.0024244 -0.0977658 -0.0234734 -0.0559571 0.0283447 0.156769 0.0186537 -0.0385631 0.0262516 0.1180578 0.0011534 -0.0424733 0.0017514 0.3225957 -0.2057464 0.0159622 -0.0095561 0.0147889 0.1106212 -0.0034501 0.0006217 -0.007764 0.0651707 0.0778545 -0.0818568 -0.0323596 -0.0425094 -0.0799617 -0.1291447 0.0006601 -0.084148 -0.0097242 0.111376 0.057611 -0.0239749 0.016423 -0.032566 0.1024799 -0.0013924 0.0676196 0.0185848 0.2526095 0.0653537 -0.0270425 0.0413767 0.1959819 0.0108966 -0.0243177 0.0160265 0.389665 0.1644944 0.0479139 -0.0420518 0.0449009 0.2053788 0.0102522 -0.0418035 0.0126462 0.388398 unknown
polarizability: 98.8960573|-4.7045834|108.1303801|4.046717|-1.6323523|49.07924 unknown
InChI: InChI=1S/C5H8N4O/c1-2-3-7-4(6)9-5(10)8-3/h7H,2,6H2,1H3
charge 0 multiplicity 1
18 atoms
O  1.621953 -2.349784 0.168403
N  -0.252668 1.201021 -0.226359
N  -0.380938 -1.183819 -0.213163
N  1.779062 -0.011275 0.149906
N  1.814572 2.328985 0.11178
C  -2.45945 0.095673 -0.54458
C  -0.964554 -0.010142 -0.332719
C  -3.229211 0.135462 0.802487
C  1.134747 1.135417 0.017554
C  1.047856 -1.241573 0.046581
H  -2.702189 0.990768 -1.152768
H  -2.766479 -0.795451 -1.116191
H  -0.743795 2.091351 -0.327304
H  -4.318055 0.170405 0.620043
H  -2.955589 1.019399 1.409161
H  -3.004087 -0.770105 1.391989
H  2.815929 2.267781 0.284606
H  1.373495 3.240287 0.014074
