program: Gaussian 09
title: 000035297
version: EM64L-G09RevD.01
frameworkgroup: C1[X(C9H5BrCl2N4)]
method: RPBEPBE
basis: SDD
operation: Freq
keyword: #p
keyword: freq=noraman
keyword: PBEPBE/SDD
title: #p freq=noraman PBEPBE/SDD
converged: YES YES NO NO
title: Mulliken charges:
elementType: Br Cl Cl N N N N C C C C C C C C C H H H H H
charge: 0.019889 0.041776 0.043855 -0.407471 -0.015097 -0.005957 0.119655 0.470983 -0.239269 -0.450639 0.122712 -0.202694 -0.185103 -0.231508 -0.267490 -0.232970 0.348926 0.336647 0.234873 0.240661 0.258220
chargesum: 0.00000
title: Mulliken charges with hydrogens summed into heavy atoms:
elementType: Br Cl Cl N N N N C C C C C C C C C
charge: 0.019889 0.041776 0.043855 -0.058545 -0.015097 -0.005957 0.119655 0.470983 0.097378 -0.215766 0.122712 -0.202694 0.055559 0.026712 -0.267490 -0.232970
polarizability: 2.73181812e+02 2.45858112e+00 2.00508377e+02 1.78627665e-01 8.39752712e-02 5.65635561e+01
1716.lowfreq: -3.4754 -3.3038 -0.0017 -0.0009 0.0011 2.7804 21.8122 50.5874 51.5896
frequency: 21.8049 50.5866 51.5868 133.3634 139.4534 153.7561 172.8077 174.4234 184.2731 271.0393 276.3564 298.4672 313.2423 392.0359 428.0103 438.9948 445.7016 562.0970 589.0114 619.3865 644.8876 661.4163 681.6089 686.6691 721.6688 786.3862 790.1716 795.3045 867.4581 882.0102 892.5728 934.3916 963.9082 973.5722 979.2958 1068.9198 1099.1426 1146.6722 1183.9334 1187.6970 1235.6569 1267.3878 1291.0327 1339.4858 1385.4115 1430.0052 1443.9926 1472.5275 1502.5843 1553.7386 1597.5289 1605.3930 3127.0807 3157.4990 3182.0904 3195.5171 3513.5794
redmass: 16.3441 6.6291 24.6143 19.6891 13.3555 7.0862 10.0277 5.8388 18.1155 9.6578 4.7522 10.1478 6.1463 17.5253 14.1428 3.1331 11.5136 4.7229 7.3180 11.8759 3.8750 7.5128 8.8240 2.1199 1.6119 2.3270 12.1437 2.7159 8.3570 11.9216 1.3958 1.3883 6.9981 1.3411 6.0211 2.0907 1.6265 5.4646 1.1287 8.1476 2.7951 4.8775 1.6257 3.6213 9.3451 3.0542 4.1700 2.9567 3.0762 6.0446 3.9386 6.4274 1.0895 1.0922 1.0974 1.0936 1.0754
irintensity: 0.1378 0.0096 0.1552 0.1586 0.0012 1.0990 0.0536 0.1682 0.4076 2.4867 2.1735 5.5562 1.5544 5.1919 5.1971 8.7823 2.5856 0.5411 27.9185 0.4263 5.4949 44.8448 22.8547 31.4681 28.6429 19.8500 74.9618 97.8989 92.3743 15.1609 1.2959 26.4773 56.3570 0.5676 7.3066 15.4886 6.9203 77.1724 12.9142 257.8678 15.7166 11.2514 119.4863 346.6000 47.1467 18.2141 513.8870 104.3405 653.1803 679.2880 345.7477 27.6521 8.8861 9.9941 4.4935 23.7217 54.7761
temp: 298.150 k
press: 1.00000 atm
elementType: 35 17 17 7 7 7 7 6 6 6 6 6 6 6 6 6 1 1 1 1 1
symmnumber: 1
zpe: 340723.9 jmol-1
zpe.correction: 0.129775 hartree
zpe.thermalcorrener: 0.143701 hartree
zpe.thermalcorrenthalpy: 0.144645 hartree
zpe.thermalcorrgfe: 0.085773 hartree
zpe.sumelectzpe: -1497.422444 hartree
zpe.sumelectthermal: -1497.408518 hartree
zpe.sumelectthermalent: -1497.407574 hartree
zpe.sumelectthermalfe: -1497.466446 hartree
dipole: -2.4107 -4.4309 -0.0085
dipole: 5.0442
quadrupole: -125.8421 -105.0696 -116.9013
quadrupole: 3.9784 -0.0136 0.0625
quadrupole: -9.9044 10.8681 -0.9636 3.9784 -0.0136 0.0625
hfenergy: -1497.552219 hartree
pointgroup: C01 [X(C9H5Br1Cl2N4)]
dipole: -1.3091371 -1.4836339 0.1530303 debye
dipolederiv: -0.1509636 0.1583371 -0.009117 0.3136333 -0.5949779 0.0357145 -0.0211078 0.039969 -0.0319699 -0.8465799 0.3816374 -0.0135161 0.4654925 -0.3293936 0.0126085 -0.0214212 0.0149171 -0.052584 -0.1141313 -0.0109345 0.0026016 -0.199346 -0.8738554 0.0755133 0.0183263 0.0694222 -0.0547574 -2.0041802 -0.1869581 0.0597259 -0.6387356 -0.3796587 0.0210601 0.0962824 0.008901 -0.3210288 -1.2744103 -0.3851103 0.0606721 -1.0676547 -1.0622205 0.1071094 0.118112 0.0876699 -0.1401374 -2.1823019 -0.0225394 0.0524937 -0.0024989 -0.5690768 0.0344009 0.0463481 0.0354467 -0.1634201 -1.0665329 0.4770193 -0.0168266 0.2938742 -1.4538807 0.1101422 -0.0027438 0.1049824 -0.0992947 1.3213433 -0.025485 -0.0299591 -0.4055169 0.1819933 0.0058906 0.0025692 -0.0038954 0.1090421 -0.4100406 0.1132849 -0.0006276 0.3461711 -0.3825048 0.0131783 -0.0194052 0.0191269 -0.0964011 -0.3634061 0.0100684 0.0032668 -0.0588852 0.0013158 -0.0143407 0.0087499 -0.0163872 -0.2042673 2.4702579 0.2854523 -0.0812521 1.1877949 0.9009199 -0.0878748 -0.1510988 -0.0629838 0.2479061 0.2773746 -0.3123855 0.0140911 -0.6670203 1.1579369 -0.0814969 0.0412067 -0.091561 -0.1099637 0.1962412 -0.0797137 -0.0023811 0.0901492 0.1428974 -0.0227916 -0.0147146 -0.0179379 -0.1172402 -0.1569977 0.0430432 -0.0023364 0.1203135 -0.4461004 0.0226939 -0.0084676 0.0248703 -0.1150741 2.3230987 -0.4105671 -0.0190028 -0.3143065 1.4379766 -0.1098517 -0.0246026 -0.107069 0.0823902 1.5478884 -0.0433985 -0.0317341 0.4880059 1.9858679 -0.1752662 -0.076276 -0.1600579 0.0911107 0.1642458 -0.0146326 0.0050859 0.0635819 0.215367 0.0061927 -0.0025016 0.008275 0.3086093 0.2600661 -0.0309128 -0.0003635 -0.0438197 0.068515 0.008872 0.0002309 0.0084631 0.1666356 0.0599838 0.1024732 -0.0049436 0.074976 -0.0660852 0.0165038 -0.0031371 0.015813 0.172793 -0.0130119 -0.0799702 0.0108809 -0.088105 -0.0308725 0.0172135 0.0114824 0.0169986 0.1588461 -0.0379434 0.031292 0.0032421 0.0418963 0.0958368 0.0045283 0.0021684 0.0050372 0.1688057 unknown
polarizability: 270.5622246|-13.8128067|202.0801103|-4.42351|-11.4767132|57.6114109 unknown
InChI: InChI=1S/C9H5BrCl2N4/c10-5-2-1-3-6(4-5)13-9-15-7(11)14-8(12)16-9/h1-4,13H
charge 0 multiplicity 1
21 atoms
Br -3.774505 2.669519 -0.104112
Cl 4.909653 -1.57025 0.014815
Cl 2.375269 3.15437 -0.327727
N  -0.081223 -1.270314 0.105559
N  1.084371 0.814837 -0.100073
N  2.235896 -1.329877 0.054969
N  3.506808 0.721289 -0.14879
C  -1.44263 -0.855176 0.10792
C  -1.842911 0.503618 0.013032
C  -2.418992 -1.882515 0.213918
C  1.082399 -0.556611 0.01541
C  -3.219978 0.792737 0.027971
C  -3.787348 -1.553002 0.225556
C  -4.209344 -0.206033 0.132684
C  3.375042 -0.631154 -0.030335
C  2.312927 1.362206 -0.175672
H  0.086847 -2.278328 0.186019
H  -1.091353 1.289221 -0.068975
H  -2.108151 -2.931842 0.286523
H  -4.536103 -2.347191 0.307349
H  -5.271275 0.052397 0.14176
