program: Gaussian 09
title: 000000672
version: EM64L-G09RevD.01
frameworkgroup: C1[X(C13H18N4O6)]
method: RPBEPBE
basis: SDD
operation: Freq
keyword: #p
keyword: freq=noraman
keyword: PBEPBE/SDD
title: #p freq=noraman PBEPBE/SDD
converged: YES YES NO NO
title: Mulliken charges:
elementType: O O O O O O N N N N C C C C C C C C C C C C C H H H H H H H H H H H H H H H H H H
charge: -0.459078 -0.496856 -0.497440 -0.462533 -0.207479 -0.217518 -0.142939 0.094809 -0.255494 -0.410677 -0.032945 -0.117630 -0.502105 -0.105708 0.332878 0.258121 -0.408740 0.035765 -0.197480 -0.850483 -0.797681 0.158558 0.062779 0.199799 0.235065 0.285366 0.268505 0.244692 0.253808 0.238301 0.424511 0.381440 0.269197 0.320651 0.259400 0.374143 0.278084 0.236495 0.233510 0.362691 0.354216
chargesum: 0.00000
title: Mulliken charges with hydrogens summed into heavy atoms:
elementType: O O O O O O N N N N C C C C C C C C C C C C C
charge: -0.034567 -0.115415 -0.123297 -0.108317 -0.207479 -0.217518 -0.142939 0.094809 -0.255494 -0.047986 0.166854 0.117435 0.051766 0.138983 0.332878 0.258121 0.083368 0.035765 -0.197480 -0.001235 -0.049592 0.158558 0.062779
polarizability: 2.36456612e+02 -7.06002438e+00 2.55785901e+02 2.25538964e+01 7.15765560e+00 1.21588003e+02
1716.lowfreq: -10.9075 -5.7652 -0.0006 0.0002 0.0004 1.4151 22.4496 31.6408 50.6472
frequency: 22.1948 31.5924 50.6405 63.3144 75.2005 83.6347 106.8077 121.2341 139.2958 149.7079 158.1599 171.1946 188.4015 208.3302 231.0965 233.8849 262.4767 281.6217 299.4848 304.5495 323.7929 338.5770 342.4611 356.2609 370.2776 396.9748 423.6274 434.6813 467.9535 487.1658 510.2835 515.8403 527.9540 564.6016 575.0973 585.2869 604.2485 621.6383 623.4244 678.5728 689.5278 693.7995 713.0933 742.3384 772.1523 796.4606 820.6783 830.3138 873.8416 900.0654 905.2762 926.0698 954.6443 975.2445 994.2981 1003.6721 1030.3071 1031.3728 1035.2577 1042.3258 1054.9367 1069.8544 1084.6653 1090.9820 1115.7154 1143.8809 1166.8163 1213.9850 1220.1139 1222.0899 1236.4085 1266.3321 1290.7783 1304.0307 1310.0827 1320.0552 1323.7615 1330.4576 1334.6009 1343.0776 1351.5136 1357.9093 1377.1760 1394.5215 1397.8167 1409.2218 1418.1228 1443.8753 1452.3236 1459.3776 1461.4019 1472.5780 1477.5340 1488.5281 1497.5744 1521.0309 1558.3959 1635.7241 1638.5355 2919.6163 2969.3692 2974.7862 2984.7027 2997.5964 3016.6113 3020.4305 3041.6159 3048.1595 3061.8134 3102.8910 3121.1379 3127.2136 3142.5963 3434.1316 3468.1882 3511.5276 3573.2520
redmass: 6.9876 6.0596 7.4857 5.9086 5.2386 4.0319 3.3300 3.5153 5.2969 7.5476 6.6744 1.2002 4.8491 3.7619 1.2934 4.6996 5.5604 3.7999 4.5803 4.9892 3.4626 1.0885 6.7019 3.2706 5.6339 6.5404 4.6762 4.7944 3.6987 3.8115 3.3166 4.6248 6.1018 2.0097 1.9055 3.2842 5.3940 3.3826 1.3309 4.1818 3.3374 3.4073 7.6078 4.8837 1.8889 5.6939 5.3506 3.9328 1.2991 2.1806 2.6007 3.6355 5.2823 4.0433 3.6570 1.8170 2.1834 1.6468 2.2049 3.1953 1.6018 2.7257 2.3090 2.7685 3.1353 1.2307 6.1420 2.8539 3.3765 1.2377 1.1681 2.4377 1.2354 1.1900 3.0107 1.2826 1.2794 1.4495 3.5414 1.1781 1.3359 1.6568 1.5126 1.8272 1.5353 2.1109 1.2265 1.2886 1.3265 1.4882 1.0814 1.6581 1.3438 1.8441 1.2920 1.4988 7.5052 9.0822 5.8191 1.0821 1.0836 1.0433 1.0393 1.0679 1.0854 1.0595 1.0656 1.0972 1.0979 1.1072 1.0974 1.0947 1.0979 1.0640 1.0648 1.0769 1.0665
irintensity: 0.6670 1.7265 1.6288 9.2957 5.3547 2.4445 1.0204 3.6936 1.9727 7.6697 3.8698 0.3782 0.4085 6.6335 2.0273 2.5845 5.5182 4.8719 17.2132 14.1287 2.2487 86.2626 11.0807 7.1992 3.5380 6.8039 25.7388 2.2669 3.6020 1.5119 2.8348 4.5894 7.3148 35.9031 35.0503 30.6565 20.9172 22.3851 203.0748 6.8178 7.2028 41.1249 0.9012 1.5223 71.7555 33.7306 32.2352 6.2659 91.9769 19.5341 33.7554 6.8157 87.5894 14.8196 83.5100 38.2754 45.6653 20.6510 32.3737 13.3067 0.6921 4.7988 15.4342 16.2955 25.6181 14.4666 66.6862 70.0758 210.7866 59.8868 6.6223 75.5775 8.9195 16.4835 14.1827 27.3469 12.3248 7.5409 0.9388 12.3151 27.1033 14.5633 125.6966 33.2747 24.2934 31.8775 37.9890 6.1326 106.8451 24.0743 3.9418 137.5823 38.8364 27.9796 140.6282 269.6736 146.4483 286.9843 516.6253 40.9841 50.9294 11.4158 17.5846 648.0973 42.9319 17.1662 10.8053 15.9593 15.9308 12.8571 2.7093 7.7556 1.4922 84.7479 44.8287 57.5031 14.0853
temp: 298.150 k
press: 1.00000 atm
elementType: 8 8 8 8 8 8 7 7 7 7 6 6 6 6 6 6 6 6 6 6 6 6 6 1 1 1 1 1 1 1 1 1 1 1 1 1 1 1 1 1 1
symmnumber: 1
zpe: 833998.8 jmol-1
zpe.correction: 0.317653 hartree
zpe.thermalcorrener: 0.339914 hartree
zpe.thermalcorrenthalpy: 0.340858 hartree
zpe.thermalcorrgfe: 0.265926 hartree
zpe.sumelectzpe: -1174.798866 hartree
zpe.sumelectthermal: -1174.776605 hartree
zpe.sumelectthermalent: -1174.775661 hartree
zpe.sumelectthermalfe: -1174.850593 hartree
dipole: -3.3502 5.7583 -0.6452
dipole: 6.6931
quadrupole: -160.4669 -132.7726 -136.2054
quadrupole: 11.8008 -8.1549 -7.1079
quadrupole: -17.3186 10.3757 6.9429 11.8008 -8.1549 -7.1079
hfenergy: -1175.1165191 hartree
pointgroup: C01 [X(C13H18N4O6)]
dipole: -1.4022465 2.0601616 -0.8506719 debye
polarizability: 235.1876323|-1.2425286|250.6979076|27.847905|-25.0462358|127.9449757 unknown
InChI: InChI=1S/C13H18N4O6/c1-5-6(2)17(3-7(19)10(21)8(20)4-18)11-9(14-5)12(22)16-13(23)15-11/h7-8,10,16,18-21H,3-4H2,1-2H3
charge 0 multiplicity 1
41 atoms
O  -1.645747 -1.784541 -0.136535
O  -3.285879 1.415651 -0.900814
O  -5.504437 0.029784 -0.480994
O  -5.437481 -0.752885 2.134541
O  4.842663 -0.338361 1.285091
O  1.66394 -3.673125 0.559459
N  0.539213 0.715003 -0.717807
N  2.947786 1.650303 0.366146
N  1.044453 -1.500084 -0.064873
N  3.220739 -1.966666 0.870231
C  -1.745643 -0.35471 -0.344302
C  -3.152156 -0.049456 -0.880192
C  -0.683374 0.159413 -1.365948
C  -4.280016 -0.662851 -0.024109
C  0.783481 2.083873 -0.670542
C  1.426648 -0.213242 -0.131135
C  -4.134034 -0.448881 1.493621
C  2.006959 2.534137 -0.106565
C  2.67663 0.332996 0.350502
C  -0.250028 3.030629 -1.222887
C  2.359917 4.002556 -0.006719
C  3.691337 -0.635071 0.875318
C  1.94255 -2.450552 0.45346
H  -1.610349 0.215041 0.604061
H  -3.257252 -0.450582 -1.9107
H  -0.371314 -0.693289 -1.994577
H  -1.122629 0.943331 -1.995213
H  -4.347337 -1.746186 -0.240784
H  -3.322291 -1.077178 1.902271
H  -3.952987 0.613102 1.727362
H  -0.642449 -1.975212 -0.074593
H  -4.271512 1.576591 -0.935123
H  -0.030582 4.05629 -0.895198
H  -1.274843 2.765698 -0.902899
H  -0.245696 3.030515 -2.330748
H  -6.166606 -0.069875 0.257607
H  3.375313 4.080812 0.409623
H  1.669377 4.552657 0.659908
H  2.345431 4.50525 -0.991067
H  3.86739 -2.679728 1.225438
H  -5.516683 -1.730959 2.268285
