program: Gaussian 09
title: 000035285
version: EM64L-G09RevD.01
frameworkgroup: C1[X(C9H7N5O3)]
method: RPBEPBE
basis: SDD
operation: Freq
keyword: #pfreq=noraman
keyword: PBEPBE/SDD
title: #p freq=noraman PBEPBE/SDD
converged: YES YES NO NO
title: Mulliken charges:
elementType: O O O N N N N N C C C C C C C C C H H H H H H H
charge: -0.170920 -0.194581 -0.201916 -0.459982 -0.073045 0.027992 -0.058054 -0.616662 0.335734 0.180949 -0.317081 -0.331614 0.392328 -0.357954 -0.374349 0.207690 -0.101977 0.304601 0.218083 0.294946 0.291013 0.319337 0.365416 0.320047
chargesum: 0.00000
title: Mulliken charges with hydrogens summed into heavy atoms:
elementType: O O O N N N N N C C C C C C C C C
charge: -0.170920 -0.194581 -0.201916 -0.140645 -0.073045 0.027992 -0.058054 0.068801 0.335734 0.180949 -0.012481 -0.113531 0.392328 -0.063008 -0.083336 0.207690 -0.101977
polarizability: 2.53094005e+02 -7.68464170e+00 1.67372912e+02 -1.53002174e+00 -3.32672674e+00 5.81091123e+01
1716.lowfreq: -9.6895 -7.2294 -2.2370 0.0002 0.0003 0.0007 29.3478 48.7526 65.5310
frequency: 29.3186 48.7520 65.5148 69.5473 96.7235 143.3357 190.5965 215.4529 222.3032 286.3285 294.0844 337.1490 369.2540 408.1413 452.2153 470.3271 505.1433 526.2553 553.7258 574.7991 584.2926 592.0194 625.5515 646.7886 672.3748 679.7752 700.8711 751.7401 772.7348 782.1485 818.0743 839.4529 885.0589 903.5643 961.5547 975.1343 982.6780 1003.5866 1016.2607 1091.3200 1104.0512 1123.9617 1174.0539 1183.8817 1217.8376 1266.3110 1298.7643 1356.4114 1369.7928 1401.6148 1406.4459 1414.8555 1481.3009 1557.2427 1589.5693 1597.4373 1607.7532 1614.8750 1658.4406 3129.5920 3169.4863 3185.0852 3189.4289 3542.6139 3549.4792 3694.9311
redmass: 6.1516 8.8296 6.9799 6.0553 7.7600 8.2571 6.4952 8.2576 10.5415 4.7754 1.2162 3.6733 6.4830 2.8703 8.1368 4.0684 7.3597 7.6679 1.1709 8.8751 1.4015 3.2549 6.4539 7.0557 4.3020 8.7538 7.4821 5.5123 8.6148 10.0414 8.3826 1.3890 1.5944 6.3639 3.8369 3.2263 1.3969 2.7570 1.4017 3.1916 1.7289 1.7407 3.8987 1.4499 5.2601 2.0474 1.3072 3.4160 6.4207 8.1596 6.0699 3.8274 2.5973 4.9824 2.1494 7.6643 2.7780 5.3602 4.2977 1.0902 1.0903 1.0944 1.0966 1.0491 1.0745 1.1051
irintensity: 4.0990 5.5754 0.1730 5.5260 7.0737 1.4303 1.2984 4.7119 0.0473 11.1039 52.3850 2.0363 2.9209 0.4036 2.4813 4.5683 0.8868 9.9935 339.3984 1.3456 7.2776 1.8012 1.9878 6.0846 20.6656 10.4941 26.2675 5.2691 31.5147 26.2620 23.8509 16.0096 42.9082 51.1636 6.9474 64.7553 2.9050 18.7477 0.1414 32.6523 26.2151 15.0162 112.0476 16.4175 370.4817 82.5055 5.2326 74.8694 98.7142 59.4382 32.7244 82.1667 13.2694 329.7369 192.8905 108.9771 266.5415 344.4383 261.3554 15.6607 2.6904 1.8933 1.7310 98.2000 33.9348 48.1351
temp: 298.150 k
press: 1.00000 atm
elementType: 8 8 8 7 7 7 7 7 6 6 6 6 6 6 6 6 6 1 1 1 1 1 1 1
symmnumber: 1
zpe: 430830.1 jmol-1
zpe.correction: 0.164095 hartree
zpe.thermalcorrener: 0.178350 hartree
zpe.thermalcorrenthalpy: 0.179294 hartree
zpe.thermalcorrgfe: 0.121240 hartree
zpe.sumelectzpe: -845.316885 hartree
zpe.sumelectthermal: -845.302629 hartree
zpe.sumelectthermalent: -845.301685 hartree
zpe.sumelectthermalfe: -845.359740 hartree
dipole: 1.2768 9.0651 1.0454
dipole: 9.2140
quadrupole: -139.6435 -89.8415 -97.7320
quadrupole: 33.3742 3.0701 -0.6746
quadrupole: -30.5712 19.2308 11.3403 33.3742 3.0701 -0.6746
hfenergy: -845.4809794 hartree
pointgroup: C01 [X(C9H7N5O3)]
dipole: -0.4354418 3.5900017 -0.2520317 debye
dipolederiv: -0.7957034 -0.3350261 -0.0103606 -0.3137271 -1.0478205 -0.0049375 0.0414985 0.0069488 -0.3530955 -0.7885335 0.1858679 0.0365853 0.2329198 -0.6224454 -0.0898678 0.0453744 -0.08914 -0.2393146 -0.8089845 -0.1908373 -0.0468679 -0.236108 -0.6371553 -0.0938117 -0.0569858 -0.0921893 -0.2463465 -1.3223704 0.3209249 -0.0553629 0.1674197 -0.7810093 0.0287739 -0.0661737 0.0203469 -0.1959557 -1.3774093 -0.2787264 0.0062404 -0.1735495 -0.6106736 0.0285337 -0.1008751 -0.0065789 -0.2271357 2.0238044 0.0100675 0.0151222 -0.0155312 1.038128 0.1882412 0.0189545 0.189061 0.2353002 -0.6732688 -0.0346467 0.0037186 0.3164656 -1.5423859 0.0674903 -0.0289024 0.0102139 -0.3032307 -0.6236343 0.537839 -0.024319 0.6777017 -1.1783709 0.063874 -0.0534346 0.110464 -0.73427 0.0229619 0.0735057 0.0061034 0.0450906 0.0630729 0.0175895 -0.0005772 0.0174061 -0.0120231 1.1234014 -0.1610505 0.0397828 -0.2424142 0.9400975 -0.1218801 0.1847878 -0.0649318 0.1475115 -0.2944544 0.171516 0.045616 0.1080244 0.0031329 0.0237379 0.0336145 0.0004277 -0.079413 -0.189682 -0.1573748 -0.0564129 -0.1017744 -0.0085581 0.0512606 -0.1038846 0.0556382 -0.1305687 -0.7874086 -0.0017357 -0.0063491 -0.055173 0.0727686 0.0054399 -0.0241179 0.0043753 0.0665312 0.1962439 -0.163042 -0.0392451 0.1528923 -0.0188753 0.0180312 0.0303278 0.010769 -0.0970406 0.0840183 0.1274572 0.0360907 -0.0816114 -0.0500003 0.007943 -0.0200274 0.0165756 -0.0912132 1.4581278 -0.2352332 -0.0203069 -0.570789 1.8593451 -0.114267 -0.0028762 -0.1020344 0.2663986 1.7421375 0.2496431 0.0479844 0.1750555 1.7711672 0.0035704 0.0005632 0.0198156 0.2651782 0.1341795 -0.0551959 -0.017322 -0.033515 0.0717757 -0.0238016 -0.0281928 -0.0091463 0.1478139 0.0256593 0.1065089 0.0229978 0.1169132 -0.0287768 -0.042117 0.0466359 -0.0360766 0.1343189 0.0976944 0.049325 0.0104067 0.0174291 0.0798259 -0.0204385 0.0088881 -0.0202795 0.1657431 0.1006044 -0.0510716 -0.0132299 -0.0235086 0.0717598 -0.0246927 -0.0034601 -0.0260361 0.1658766 0.2065403 -0.0435193 0.0178711 -0.0360503 0.1316983 0.0306598 0.0546758 0.0256523 0.3245239 0.2846878 -0.0772507 0.0064915 -0.0555415 0.1991169 0.0033972 0.0157515 -0.001469 0.3936136 0.1613884 -0.047945 -0.0052344 -0.0706185 0.2241826 -0.0027289 0.008436 -0.0398125 0.3967976 unknown
polarizability: 253.3236618|6.0953801|166.5829689|2.0308954|8.4982817|58.6693984 unknown
InChI: InChI=1S/C9H7N5O3/c10-8-11-7(12-9(15)13-8)5-1-3-6(4-2-5)14(16)17/h1-4,11H,10H2
charge 0 multiplicity 1
24 atoms
O  -3.976791 -2.324123 -0.067215
O  5.079674 -1.121917 -0.219402
O  5.081306 1.106982 0.270337
N  -1.998527 1.180969 -0.211082
N  -1.927503 -1.189393 0.052935
N  4.477751 -0.007066 0.021245
N  -4.086578 0.017551 -0.027074
N  -4.066525 2.350545 -0.208698
C  0.18642 0.014575 -0.02436
C  -1.301975 -0.034711 -0.05751
C  0.896937 -1.190285 -0.273642
C  0.90686 1.206499 0.259484
C  2.990816 -0.003326 0.00979
C  2.301932 -1.206808 -0.260154
C  2.314126 1.205085 0.277807
C  -3.404429 1.146869 -0.141513
C  -3.383524 -1.222977 -0.02293
H  0.315959 -2.096657 -0.466773
H  0.387384 2.137741 0.513718
H  2.868804 -2.120929 -0.453496
H  2.890944 2.105996 0.501338
H  -1.495088 2.043672 -0.419998
H  -5.083866 2.306071 -0.187324
H  -3.600308 3.253936 -0.187582
