program: Gaussian 09
title: 000035302
version: EM64L-G09RevD.01
frameworkgroup: C1[X(C18H17N3)]
method: RPBEPBE
basis: SDD
operation: Freq
keyword: #pfreq=noraman
keyword: PBEPBE/SDD
title: #p freq=noraman PBEPBE/SDD
converged: YES YES NO NO
title: Mulliken charges:
elementType: N N N C C C C C C C C C C C C C C C C C C H H H H H H H H H H H H H H H H H
charge: -0.061502 -0.056456 -0.056982 0.301412 0.301313 -0.069733 -0.069440 0.444852 0.444872 -0.355311 -0.348751 -0.355298 -0.348811 -0.386473 -0.388303 -0.386492 -0.388326 0.017173 -0.809381 -0.809376 -0.752909 0.266979 0.276761 0.266978 0.276738 0.231434 0.231785 0.231431 0.231786 0.227640 0.227293 0.238947 0.227285 0.227638 0.238940 0.243464 0.244541 0.244285
chargesum: 0.00000
title: Mulliken charges with hydrogens summed into heavy atoms:
elementType: N N N C C C C C C C C C C C C C C C C C C
charge: -0.061502 -0.056456 -0.056982 0.301412 0.301313 -0.069733 -0.069440 0.444852 0.444872 -0.088332 -0.071990 -0.088320 -0.072073 -0.155040 -0.156519 -0.155062 -0.156540 0.017173 -0.115501 -0.115513 -0.020619
polarizability: 3.88430353e+02 6.01788874e-02 2.54381199e+02 8.47999516e-02 -1.24742508e+00 9.72431827e+01
1716.lowfreq: -50.9594 -7.4184 -6.8159 -0.0009 -0.0007 -0.0006 2.9655 19.0179 22.3545
frequency: -50.9579 18.7104 22.0381 35.7049 36.1480 56.5691 61.2364 72.9972 133.8104 156.2935 156.4020 176.7768 228.4430 249.7050 289.2747 302.0227 318.8250 333.1662 368.0263 403.5017 407.3054 409.4107 476.7691 491.7356 554.0709 559.0659 573.6218 588.0062 614.4186 635.8136 637.7215 680.2515 728.2704 749.2900 761.3394 788.5924 815.2096 829.9971 853.4239 862.6848 864.1473 867.5537 901.6211 920.1115 985.2114 986.2850 989.0224 992.2241 994.6096 1000.4492 1001.1140 1010.9578 1011.7424 1046.5225 1046.8017 1050.6494 1086.0094 1113.1205 1118.5413 1134.2666 1174.0260 1187.2488 1187.5534 1222.2834 1222.7967 1284.8109 1301.0992 1316.5159 1334.5373 1375.9638 1379.9043 1388.2409 1395.9085 1395.9465 1409.1403 1411.1725 1418.5024 1441.5612 1442.6339 1464.4904 1468.4459 1473.0980 1473.1577 1473.5291 1476.7572 1509.2608 1519.1425 1577.0302 1579.0681 1621.3932 1622.3978 2974.7327 2974.7992 2994.3946 3056.4333 3056.4627 3085.3311 3087.1454 3087.2291 3124.5642 3124.6456 3127.1334 3127.3306 3131.7664 3164.9515 3165.3287 3168.7381 3169.1370
redmass: 1.0121 1.0297 1.0378 3.3681 3.7875 4.5218 3.9449 4.8170 4.0729 6.4156 4.5691 5.4448 5.3806 3.4492 4.7652 3.5388 4.5744 3.5184 3.3995 3.4571 2.8813 2.9918 2.8713 2.7913 5.1462 6.3909 6.3391 4.9454 3.3954 6.9390 6.9519 4.3928 3.2030 2.8804 4.9948 4.8946 2.2072 6.6642 1.6221 1.2553 1.2532 2.4738 6.9366 12.8297 1.4532 1.4058 1.3597 1.3588 1.7991 1.3656 1.3665 3.0347 2.5963 1.5874 1.5889 1.6708 4.1409 1.4767 1.2909 3.1121 2.0498 1.1422 1.7978 2.8904 2.8992 2.3180 1.3284 1.8978 4.5260 4.9713 3.3184 1.6181 1.2225 1.2232 3.9492 3.8760 3.1979 2.0741 1.7406 1.5509 1.1278 1.1644 1.0895 1.2568 1.6269 2.9803 3.5338 6.4583 6.5571 6.3796 6.4386 1.0391 1.0391 1.0408 1.0942 1.0942 1.0911 1.1000 1.1000 1.0896 1.0896 1.0899 1.0898 1.1021 1.0937 1.0936 1.0953 1.0952
irintensity: 0.1813 0.5871 0.6152 0.0066 0.5441 0.4523 1.4959 0.0022 0.6184 0.0065 0.0421 1.1523 0.2165 0.3224 0.0140 0.0058 4.0145 0.1453 1.5179 0.2314 0.0101 0.1143 0.1100 31.6752 2.5322 13.9519 16.2641 0.1951 9.9766 0.7423 2.1436 0.0293 2.5264 0.2672 9.4138 0.4314 88.1498 5.0888 0.2981 0.0093 0.0338 23.7442 4.5035 2.9005 0.1726 0.0505 0.8022 6.9310 0.4687 0.1035 0.8250 2.2212 21.8250 22.7623 31.6610 14.0492 2.5290 3.2381 14.3078 0.0682 73.4815 12.0318 54.2003 2.6833 0.6133 8.5706 1.8423 5.3280 184.0496 81.2023 8.6321 84.3878 11.4903 7.6594 23.0537 35.0177 7.4656 843.9445 245.2647 103.6885 10.3631 79.9601 28.5756 137.4611 384.7462 11.3850 0.2717 4.5455 3.6974 111.4655 33.6511 52.8186 15.6549 5.3225 10.8888 35.5192 13.1694 15.0680 17.3642 5.9811 31.0037 44.1329 5.0867 8.4143 3.9068 10.3170 8.9126 3.1124
temp: 298.150 k
press: 1.00000 atm
elementType: 7 7 7 6 6 6 6 6 6 6 6 6 6 6 6 6 6 6 6 6 6 1 1 1 1 1 1 1 1 1 1 1 1 1 1 1 1 1
symmnumber: 1
zpe: 793873.9 jmol-1
zpe.correction: 0.302371 hartree
zpe.thermalcorrener: 0.320952 hartree
zpe.thermalcorrenthalpy: 0.321896 hartree
zpe.thermalcorrgfe: 0.251872 hartree
zpe.sumelectzpe: -858.934217 hartree
zpe.sumelectthermal: -858.915636 hartree
zpe.sumelectthermalent: -858.914692 hartree
zpe.sumelectthermalfe: -858.984716 hartree
dipole: 0.0007 -1.2957 0.0619
dipole: 1.2972
quadrupole: -94.5702 -108.5555 -128.2477
quadrupole: 0.0119 0.0212 -0.5472
quadrupole: 15.8876 1.9023 -17.7899 0.0119 0.0212 -0.5472
hfenergy: -859.236588 hartree
pointgroup: C01 [X(C18H17N3)]
dipole: 0.0005767 0.51036 0.0010517 debye
polarizability: 388.4302471|-0.1363382|254.1155836|-0.0680214|6.5758874|97.5089044 unknown
InChI: InChI=1S/C18H17N3/c1-12-4-8-15(9-5-12)17-19-14(3)20-18(21-17)16-10-6-13(2)7-11-16/h4-11H,1-3H3
charge 0 multiplicity 1
38 atoms
N  0.000182 -0.021428 -0.016917
N  1.210138 -2.119433 -0.13292
N  -1.212277 -2.118046 -0.13306
C  -2.449499 -0.00558 -0.016642
C  2.449897 -0.008513 -0.01619
C  -1.16633 -0.742429 -0.055332
C  1.165839 -0.743928 -0.055348
C  -4.931143 1.411959 0.059823
C  4.933095 1.406166 0.061184
C  -2.467736 1.412809 0.059397
C  -3.68319 -0.70924 -0.050687
C  2.469707 1.409436 0.066986
C  3.682771 -0.713229 -0.056757
C  -3.691986 2.106442 0.098224
C  -4.902507 -0.007001 -0.011015
C  3.694751 2.101666 0.106318
C  4.902891 -0.012391 -0.016804
C  -0.001512 -2.754509 -0.167808
C  -6.247878 2.166021 0.069339
C  6.250594 2.158913 0.07117
C  -0.001913 -4.258644 -0.226164
H  -1.512892 1.945773 0.090403
H  -3.657109 -1.801618 -0.1050
H  1.515472 1.943174 0.102998
H  3.655457 -1.80532 -0.116046
H  -3.693033 3.201467 0.15968
H  -5.848231 -0.561954 -0.033832
H  3.697051 3.196349 0.17352
H  5.84801 -0.568123 -0.045019
H  -7.05166 1.574201 0.541324
H  -6.162981 3.125058 0.609891
H  -6.57564 2.399454 -0.9628
H  6.16791 3.115347 0.616665
H  7.054972 1.564026 0.538262
H  6.576037 2.397139 -0.960607
H  0.014254 -4.672841 0.800153
H  -0.915295 -4.623347 -0.721105
H  0.896979 -4.62293 -0.747582
