program: Gaussian 09
title: 000035293
version: EM64L-G09RevD.01
frameworkgroup: C1[X(C9H5ClF2N4)]
method: RPBEPBE
basis: SDD
operation: Freq
keyword: #p
keyword: freq=noraman
keyword: PBEPBE/SDD
title: #p freq=noraman PBEPBE/SDD
converged: NO YES NO NO
title: Mulliken charges:
elementType: Cl F F N N N N C C C C C C C C C H H H H H
charge: -0.042657 -0.128557 -0.128398 -0.400561 -0.090919 -0.083046 -0.035067 0.464673 -0.427942 -0.300147 0.081245 -0.182110 -0.199535 -0.121293 0.067783 0.095686 0.350139 0.235450 0.322958 0.261395 0.260904
chargesum: 0.00000
title: Mulliken charges with hydrogens summed into heavy atoms:
elementType: Cl F F N N N N C C C C C C C C C
charge: -0.042657 -0.128557 -0.128398 -0.050421 -0.090919 -0.083046 -0.035067 0.464673 -0.192493 0.022811 0.081245 0.079285 0.061370 -0.121293 0.067783 0.095686
polarizability: 2.65745825e+02 4.82814533e-01 1.32918687e+02 4.06384998e-02 1.06328354e-01 5.09765459e+01
1716.lowfreq: -3.3661 0.0012 0.0016 0.0021 7.2887 8.5512 39.2673 47.9229 79.6253
frequency: 39.2252 47.6534 79.6248 118.4573 192.4361 201.5850 203.0007 220.8006 227.2247 319.7677 343.7237 348.7595 413.4905 431.1119 508.1928 529.5069 546.2131 549.5643 622.6496 663.3140 664.2933 682.0268 707.6660 727.3100 731.0592 781.6956 820.7499 826.3171 849.0379 885.7328 944.8132 986.9588 990.6789 996.4669 1021.6455 1076.6482 1119.2673 1188.6230 1195.1483 1248.7461 1294.5477 1317.5817 1332.8166 1365.2844 1400.5612 1417.1710 1474.2238 1497.8573 1527.4184 1572.2091 1606.6439 1606.8269 3127.0389 3170.4442 3176.5921 3197.8887 3513.8573
redmass: 12.9709 4.4976 12.9581 9.8567 13.6268 11.5172 10.7675 8.9933 14.9416 5.3907 5.5690 13.9359 3.0184 10.2813 2.7887 10.9612 15.1875 13.5873 7.3086 3.4037 7.4351 11.1924 3.6484 8.8059 1.8143 5.8886 1.3881 5.9169 1.3944 13.7962 1.3605 9.8958 1.3134 4.4443 8.3735 2.6160 1.3599 1.1205 4.5601 3.6663 1.4911 4.1356 10.5990 6.3495 5.8402 3.4692 2.8826 2.8400 5.4237 7.7743 4.1671 6.2605 1.0908 1.0913 1.0952 1.0956 1.0755
irintensity: 0.9297 0.0790 1.0754 0.0385 1.9706 0.0560 0.7948 0.0347 0.4740 1.1620 0.0166 7.0979 0.0001 24.0226 34.5889 3.2950 3.0384 7.7446 1.4872 22.2289 2.3012 0.7154 1.8857 14.9639 14.0774 33.2666 61.7949 29.0236 63.4504 9.7449 1.9140 52.9256 2.9375 57.0500 31.3790 48.3079 22.3502 0.6478 24.0590 16.9996 10.0084 105.9987 262.1425 191.3826 136.1308 55.6888 375.8581 82.5016 687.7597 628.0292 298.2338 16.4330 10.2119 1.4797 1.5501 12.1308 56.2055
temp: 298.150 k
press: 1.00000 atm
elementType: 17 9 9 7 7 7 7 6 6 6 6 6 6 6 6 6 1 1 1 1 1
symmnumber: 1
zpe: 350805.8 jmol-1
zpe.correction: 0.133615 hartree
zpe.thermalcorrener: 0.146420 hartree
zpe.thermalcorrenthalpy: 0.147364 hartree
zpe.thermalcorrgfe: 0.092619 hartree
zpe.sumelectzpe: -1223.591965 hartree
zpe.sumelectthermal: -1223.579160 hartree
zpe.sumelectthermalent: -1223.578216 hartree
zpe.sumelectthermalfe: -1223.632961 hartree
dipole: -2.8747 -2.6594 -0.0073
dipole: 3.9162
quadrupole: -124.6089 -94.0139 -97.8875
quadrupole: 2.2297 -0.0235 0.0694
quadrupole: -19.1054 11.4895 7.6159 2.2297 -0.0235 0.0694
hfenergy: -1223.7255803 hartree
pointgroup: C01 [X(C9H5Cl1F2N4)]
dipole: 1.1569737 -1.0020843 -0.176441 debye
dipolederiv: -0.9592269 -0.172303 -0.0225577 -0.2465511 -0.1649575 -0.0159803 -0.0351472 -0.0165289 -0.061673 -1.0557319 -0.3646421 -0.0598185 -0.538592 -0.4804711 -0.0489914 -0.090372 -0.0496544 -0.1949607 -0.2998417 0.0791394 0.0143468 0.3674538 -1.0201749 -0.1470115 0.0637982 -0.1443289 -0.2121688 -1.8614135 0.1334607 0.0322458 0.5770722 -0.2869618 0.0008888 0.107302 0.0036201 -0.3087942 -1.2671639 0.3013454 0.057229 0.9976028 -0.8270526 -0.122375 0.1769801 -0.1171192 -0.1788263 -1.9544465 0.0609471 0.0198053 -0.0822177 -0.5091046 -0.0555468 -0.0092653 -0.0567801 -0.1933453 -0.9567011 -0.2409721 -0.0382865 -0.0613697 -1.078635 -0.1600236 -0.0082551 -0.1589153 -0.1874878 1.0969763 0.1199387 0.0139159 0.3661669 0.0465155 -0.0088304 0.0572438 -0.0072738 0.0799575 -0.1289813 -0.0154424 -0.0031522 0.0010093 0.0668465 0.0421781 -0.0002113 0.0425342 -0.1783136 -0.1393811 0.0026292 0.0001755 -0.0381166 -0.0499227 0.0147394 -0.0072537 0.0147481 -0.1348035 2.4646382 -0.273071 -0.0597212 -1.0690839 0.7795227 0.1078037 -0.1909361 0.1024798 0.2176058 -0.2257842 -0.0846929 -0.013285 -0.242722 -0.0116271 0.0142066 -0.039212 0.0128754 -0.0839403 -0.3620054 -0.0376541 -0.0042822 0.0596543 0.0590628 0.0244425 0.0115184 0.0253388 -0.0852566 1.2669973 0.3004234 0.0408407 0.3516298 0.140169 0.0341459 0.0497048 0.0345497 -0.0728489 2.2080578 0.2394113 0.0335415 0.1474053 1.3588865 0.1882687 0.0190769 0.1871077 0.308434 1.6848827 -0.045375 -0.0137591 -0.5277225 1.7077777 0.2509814 -0.0962878 0.2471384 0.3257188 0.1658676 0.0140577 0.0034307 -0.0592384 0.2208666 -0.0155238 -0.010006 -0.0161617 0.3102687 0.0513942 -0.0890611 -0.014154 -0.06817 -0.0613789 -0.0381992 -0.0108196 -0.0381598 0.1636318 0.1842624 0.0329364 0.0052889 0.0448484 0.0749621 -0.0162499 0.0069707 -0.0162789 0.1677186 0.0125138 0.0682936 0.0124725 0.064697 0.0467676 -0.0203947 0.0118092 -0.020442 0.1626779 0.0750872 -0.0293693 -0.004276 -0.0437558 -0.0110907 -0.0285286 -0.006638 -0.028749 0.1564058 unknown
polarizability: 265.6776433|3.0447209|130.6782518|-0.8312147|13.5402069|53.2851623 unknown
InChI: InChI=1S/C9H5ClF2N4/c10-5-1-3-6(4-2-5)13-9-15-7(11)14-8(12)16-9/h1-4,13H
charge 0 multiplicity 1
21 atoms
Cl 5.758145 0.711829 0.123746
F  -4.617677 -1.466595 -0.187774
F  -2.698492 2.676531 0.525192
N  -0.006176 -1.113479 -0.142677
N  -1.301862 0.87213 0.207738
N  -2.316331 -1.316887 -0.168114
N  -3.717496 0.632832 0.17416
C  1.326469 -0.615059 -0.066859
C  2.367793 -1.567853 -0.233431
C  1.646851 0.749171 0.159208
C  -1.211736 -0.483635 -0.026525
C  3.717254 -1.170212 -0.176484
C  2.999269 1.146169 0.216005
C  4.016788 0.188142 0.048316
C  -3.486887 -0.686207 -0.055929
C  -2.56286 1.322783 0.290578
H  -0.108318 -2.118748 -0.315669
H  2.129207 -2.624064 -0.408376
H  0.847783 1.480172 0.287633
H  4.518035 -1.903479 -0.304536
H  3.252042 2.195759 0.390097
