program: Gaussian 09
title: 000035335
version: EM64L-G09RevD.01
frameworkgroup: C1[X(C11H13N5O5)]
method: RPBEPBE
basis: SDD
operation: Freq
keyword: #p
keyword: freq=noraman
keyword: PBEPBE/SDD
title: #p freq=noraman PBEPBE/SDD
converged: YES YES NO NO
title: Mulliken charges:
elementType: O O O O O N N N N N C C C C C C C C C C C H H H H H H H H H H H H H
charge: -0.189712 -0.271488 -0.254261 -0.213626 -0.208223 -0.431639 -0.023688 -0.376345 0.023236 0.015462 0.305199 0.261106 -0.472748 0.222185 -0.293853 -0.498406 0.445925 -0.369051 -0.792078 0.274738 -0.770428 0.229397 0.272409 0.298254 0.335138 0.380334 0.291729 0.247832 0.243561 0.279382 0.307105 0.260449 0.259477 0.212626
chargesum: 0.00000
title: Mulliken charges with hydrogens summed into heavy atoms:
elementType: O O O O O N N N N N C C C C C C C C C C C
charge: -0.189712 -0.271488 -0.254261 -0.213626 -0.208223 -0.051305 -0.023688 -0.069240 0.023236 0.015462 0.305199 0.261106 0.029058 0.222185 0.004401 -0.163268 0.445925 -0.077322 -0.021302 0.274738 -0.037876
polarizability: 3.77396396e+02 -1.42232234e+01 1.98922827e+02 2.37577645e+01 9.52100883e+00 1.05541431e+02
1716.lowfreq: -1.2824 0.0009 0.0010 0.0010 4.1979 5.9137 20.9545 31.5954 48.5055
frequency: 20.9471 31.4193 48.5010 55.1516 64.1745 69.0575 69.8938 80.5950 108.7749 140.6368 158.0432 163.8391 174.0679 202.6984 223.6098 237.7491 270.1819 302.6544 316.1789 351.9873 361.8663 391.6598 410.2392 440.8005 472.4380 502.7651 513.7959 515.2763 527.4759 566.6918 605.1309 607.5632 640.0288 651.6734 674.6655 702.1093 705.9647 725.0743 753.4002 783.6453 812.9206 847.7343 859.3599 862.3624 891.3176 954.6095 963.6174 980.0413 994.9945 1010.3017 1041.5859 1043.8360 1051.7857 1072.7865 1100.1357 1108.0306 1136.5228 1167.1161 1212.1803 1231.5882 1242.1960 1247.3542 1283.9021 1305.2307 1326.4578 1341.3018 1359.5512 1386.6470 1388.6906 1390.0633 1440.5817 1449.0167 1449.6043 1459.5042 1467.7979 1476.2937 1484.7664 1490.6538 1520.1210 1578.5821 1592.6579 1616.8210 1624.9332 2974.5022 2986.2484 2998.2464 3050.5301 3052.2679 3098.6602 3102.6528 3109.6977 3180.1114 3189.3599 3201.5764 3238.3265 3563.1384
redmass: 5.7956 6.1022 5.3267 8.5956 7.6120 5.4299 1.2110 5.1332 2.9462 7.6058 5.7447 5.3107 1.2118 5.2548 3.6484 4.4010 3.6998 4.2901 7.8871 3.9934 7.4488 5.7731 5.0843 3.9975 4.8347 6.1671 3.9139 3.7530 1.3753 3.5374 2.7834 4.5950 6.6027 7.8524 9.6438 4.5517 7.7737 4.8165 12.6723 4.3600 1.1910 3.1346 3.1536 1.4728 6.5480 1.5774 1.4062 1.9665 2.1824 1.3172 1.7417 2.1120 1.9962 2.5986 4.1763 3.4507 1.3450 9.4154 4.8290 1.7610 1.7007 1.5576 2.8289 2.4973 1.3410 4.3424 7.1636 3.9660 1.2258 1.2440 1.1922 3.0251 1.1875 1.3508 1.0873 1.0532 2.3919 1.7118 3.3383 4.7611 7.2899 6.2334 7.2978 1.0395 1.0598 1.0362 1.1013 1.0973 1.0987 1.1000 1.0965 1.0896 1.0919 1.0961 1.0789 1.0786
irintensity: 1.1314 1.2768 8.5684 2.3544 2.4896 2.0889 0.9978 1.9757 4.1368 1.3534 4.1477 3.1652 0.7205 17.3473 11.9589 1.7578 1.3313 1.0556 0.2720 2.5755 4.0404 3.5405 6.1977 2.1200 12.5584 17.4760 8.4552 7.4386 87.2520 37.9629 1.3402 1.2439 3.7614 16.3471 8.7343 1.2116 8.3226 1.4648 9.9326 1.1116 88.2531 2.0053 18.6390 22.3293 4.0848 3.8141 24.2121 5.5930 8.6017 0.0463 19.6808 2.1699 21.1339 41.9623 54.8595 6.9070 47.6025 375.5633 454.4288 149.5719 21.7140 40.0094 73.2624 136.9963 54.7593 194.5393 66.8403 29.4117 40.4581 43.8498 18.6273 8.2312 13.4899 23.7408 52.9304 28.2358 78.3271 135.1036 56.5674 61.0318 77.3076 171.9986 450.8442 8.2538 22.1409 14.0071 8.9170 7.4188 10.5170 16.4877 16.6507 3.1431 19.8210 0.0225 68.4474 19.5408
temp: 298.150 k
press: 1.00000 atm
elementType: 8 8 8 8 8 7 7 7 7 7 6 6 6 6 6 6 6 6 6 6 6 1 1 1 1 1 1 1 1 1 1 1 1 1
symmnumber: 1
zpe: 649891.0 jmol-1
zpe.correction: 0.247530 hartree
zpe.thermalcorrener: 0.268066 hartree
zpe.thermalcorrenthalpy: 0.269011 hartree
zpe.thermalcorrgfe: 0.195657 hartree
zpe.sumelectzpe: -1075.129419 hartree
zpe.sumelectthermal: -1075.108883 hartree
zpe.sumelectthermalent: -1075.107939 hartree
zpe.sumelectthermalfe: -1075.181293 hartree
dipole: -11.9670 -1.6443 -4.1279
dipole: 12.7652
quadrupole: -118.3457 -135.1624 -120.9488
quadrupole: 6.1426 8.6608 1.5265
quadrupole: 6.4733 -10.3434 3.8701 6.1426 8.6608 1.5265
hfenergy: -1075.3769497 hartree
pointgroup: C01 [X(C11H13N5O5)]
dipole: -4.8595475 -0.0936371 -1.2644373 debye
polarizability: 378.7305321|-14.8858452|180.0634075|-9.2883324|40.195152|123.0667139 unknown
InChI: InChI=1S/C11H13N5O5/c1-7(6-12-8(2)17)13-14-10-4-3-9(15(18)19)5-11(10)16(20)21/h3-5,12,14H,6H2,1-2H3
charge 0 multiplicity 1
34 atoms
O  2.809138 3.006656 1.246297
O  0.553999 2.79641 1.003504
O  -3.949422 -1.022119 1.698793
O  5.100319 -2.280706 -1.244589
O  5.8735 -0.382822 -0.231974
N  -0.444368 0.684587 -0.142554
N  -1.487558 -0.102235 -0.627217
N  -5.039823 -0.535372 -0.287086
N  1.781107 2.340151 0.851858
N  4.917623 -1.131737 -0.675728
C  0.853721 0.249594 -0.265109
C  1.967324 1.039547 0.213457
C  -3.800346 -0.491767 -1.082783
C  -2.706217 0.378565 -0.476117
C  1.150038 -1.013289 -0.878878
C  3.29681 0.582976 0.077446
C  3.531917 -0.654763 -0.530373
C  2.460005 -1.461565 -1.010687
C  -3.05441 1.702004 0.167835
C  -5.035037 -0.855569 1.064633
C  -6.40406 -0.979675 1.724065
H  -4.072536 -0.09078 -2.079426
H  -3.377568 -1.502699 -1.228377
H  0.305022 -1.607118 -1.231077
H  4.124544 1.195301 0.443936
H  -0.565213 1.598947 0.337862
H  2.68991 -2.424177 -1.474643
H  -4.131698 1.908824 0.077309
H  -2.498616 2.543858 -0.290006
H  -2.81118 1.682815 1.247647
H  -5.93182 -0.434471 -0.771931
H  -6.52195 -2.005424 2.114402
H  -6.45349 -0.296691 2.58911
H  -7.245467 -0.759257 1.044702
