program: Gaussian 09
title: 000035427
version: EM64L-G09RevD.01
frameworkgroup: C1[X(C14H19NO5)]
method: RPBEPBE
basis: SDD
operation: Freq
keyword: #p
keyword: freq=noraman
keyword: PBEPBE/SDD
title: #p freq=noraman PBEPBE/SDD
converged: YES YES NO NO
title: Mulliken charges:
elementType: O O O O O N C C C C C C C C C C C C C C H H H H H H H H H H H H H H H H H H H
charge: -0.307800 -0.306748 -0.286632 -0.449692 -0.283067 -0.413457 0.611768 0.036096 0.278121 0.236461 -0.564828 -0.580151 -0.263216 -0.361027 -0.383784 0.238968 -0.314470 -0.524060 -0.527672 -0.522451 0.247708 0.264705 0.275588 0.222040 0.237673 0.207982 0.300997 0.220591 0.235190 0.257408 0.234832 0.229138 0.231467 0.223336 0.252700 0.231858 0.260906 0.215864 0.337659
chargesum: 0.00000
title: Mulliken charges with hydrogens summed into heavy atoms:
elementType: O O O O O N C C C C C C C C C C C C C C
charge: -0.307800 -0.306748 -0.286632 -0.112032 -0.283067 -0.112460 0.611768 0.036096 0.278121 0.236461 -0.317120 -0.315447 0.012372 0.098687 -0.175802 0.238968 0.141311 0.197318 0.179831 0.186177
polarizability: 3.35753454e+02 4.15164034e+00 1.83197147e+02 -1.53784516e+01 -2.68928272e+00 1.08674410e+02
1716.lowfreq: -8.5764 -6.1909 -0.0006 -0.0006 0.0003 2.9689 19.6652 29.5385 48.6054
frequency: 19.3868 29.5332 48.5460 50.1937 63.4030 73.8571 79.1447 93.7636 98.8823 111.9501 143.6997 152.5983 156.7885 166.4162 171.7723 187.6456 209.0806 227.7556 242.4206 254.9303 274.9348 292.0586 310.9484 328.2227 348.1967 367.0854 425.2654 438.6201 484.2520 512.4458 514.0199 534.7651 577.8570 600.2398 621.6290 642.9880 701.7793 710.4293 750.1866 771.1252 847.9101 857.0690 864.0596 867.7932 881.7867 899.7068 912.5960 937.4820 953.8427 998.9645 1012.3943 1013.5841 1035.6924 1074.7253 1083.8239 1109.6618 1112.1896 1113.8086 1122.8631 1150.3960 1156.2117 1158.3044 1174.6753 1192.0792 1195.5928 1218.6853 1261.8830 1272.3588 1311.3516 1329.0423 1334.2037 1352.8592 1363.6541 1371.1336 1400.6986 1417.7743 1424.5434 1434.7524 1436.6300 1455.0207 1458.3721 1460.2129 1466.9943 1468.3204 1475.0116 1476.9761 1483.6814 1486.1857 1559.8369 1580.4313 1603.0002 1653.7735 2974.7269 2977.1827 2980.8894 2999.5416 3007.8246 3073.6527 3077.5918 3082.6043 3084.0197 3090.7251 3099.2301 3106.6760 3123.2226 3125.4995 3128.5916 3156.1499 3163.2076 3556.9355 3557.8938
redmass: 5.5657 5.2214 4.2166 4.6901 4.6186 2.8327 3.0704 3.1175 2.8547 2.8127 1.8767 2.1503 1.2168 1.1138 2.1787 3.6561 3.8686 4.3590 4.1031 4.1972 5.1683 3.3931 1.4352 3.9560 2.3114 5.1887 5.4091 4.5897 3.0644 3.5362 2.8111 1.6092 5.2545 4.5032 3.3016 4.4315 4.7483 5.4333 4.2545 3.5533 2.2541 3.3658 2.7368 2.6116 1.8193 1.7944 4.9083 9.3945 2.7603 3.0601 1.2199 3.6794 6.2935 2.0858 3.0001 1.2383 1.2625 1.2425 2.9258 1.3539 1.4582 1.4445 1.2543 1.6887 2.0583 1.4491 1.3604 1.6553 2.1379 1.2679 2.0075 1.3255 4.4300 1.2488 2.2754 1.2730 1.1724 1.2365 1.5218 1.1488 1.0615 1.0888 1.9783 1.1249 1.7602 1.1094 1.0551 1.0557 7.1492 6.7692 6.6154 5.5932 1.0312 1.0332 1.0295 1.0634 1.0599 1.1031 1.1018 1.1052 1.0999 1.1038 1.0930 1.0872 1.1030 1.1035 1.1043 1.0918 1.0917 1.0719 1.0721
irintensity: 0.3800 0.6468 0.6514 6.9912 4.7157 2.9496 2.8727 8.0604 5.2856 6.9297 2.7775 0.9866 1.0751 0.2656 3.1747 0.8929 4.9813 7.9184 19.0123 20.4489 7.7324 36.6336 124.9140 7.8950 69.1748 3.7019 10.2209 6.7391 4.1040 8.3163 7.4293 38.8040 26.0645 0.9462 7.1324 9.9963 1.6662 3.1359 2.5589 9.4465 8.6192 23.1425 22.7802 35.1642 9.1682 5.7491 53.4613 68.5343 18.3365 101.8043 55.9015 38.5108 167.6263 5.3319 35.1762 12.0230 15.0792 4.5187 22.7251 1.9833 5.2645 15.2137 27.4236 98.4046 51.5109 20.3642 74.9509 324.5978 64.3879 44.6720 9.5495 9.8116 3.1531 27.3115 73.4648 4.1965 44.8971 37.4839 37.5799 21.5408 21.2969 0.3274 21.6538 7.2004 332.5004 18.0067 18.7805 34.0365 117.0416 190.7727 27.8074 125.0845 63.9400 103.6602 65.3347 30.6697 38.6144 25.9537 14.8618 17.1216 34.8258 53.0069 2.6345 14.3502 21.8053 24.7500 16.3359 2.4187 1.6039 7.7222 21.3747
temp: 298.150 k
press: 1.00000 atm
elementType: 8 8 8 8 8 7 6 6 6 6 6 6 6 6 6 6 6 6 6 6 1 1 1 1 1 1 1 1 1 1 1 1 1 1 1 1 1 1 1
symmnumber: 1
zpe: 816089.9 jmol-1
zpe.correction: 0.310832 hartree
zpe.thermalcorrener: 0.333376 hartree
zpe.thermalcorrenthalpy: 0.334320 hartree
zpe.thermalcorrgfe: 0.256888 hartree
zpe.sumelectzpe: -974.166820 hartree
zpe.sumelectthermal: -974.144276 hartree
zpe.sumelectthermalent: -974.143332 hartree
zpe.sumelectthermalfe: -974.220764 hartree
dipole: -4.7822 3.3840 -1.9950
dipole: 6.1887
quadrupole: -114.8902 -118.2556 -117.6384
quadrupole: 2.0459 -8.5798 -2.8286
quadrupole: 2.0379 -1.3275 -0.7104 2.0459 -8.5798 -2.8286
hfenergy: -974.4776519 hartree
pointgroup: C01 [X(C14H19N1O5)]
dipole: 1.9148569 -1.3400949 -0.6825387 debye
polarizability: 334.7311012|6.5841588|183.4265629|20.7799824|-0.0340102|109.4673462 unknown
InChI: InChI=1S/C14H19NO5/c1-18-11-8-10(4-5-13(17)15-6-7-16)9-12(19-2)14(11)20-3/h4-5,8-9,15-16H,6-7H2,1-3H3
charge 0 multiplicity 1
39 atoms
O  4.417782 -0.284678 0.644483
O  2.577196 -2.478557 0.273654
O  3.351552 2.412344 0.559482
O  -6.75789 -1.087938 1.572882
O  -3.93259 1.593565 -0.361604
N  -4.587363 -0.63621 -0.463497
C  0.2465 0.426373 0.061514
C  3.043724 -0.054024 0.410199
C  2.130847 -1.136692 0.222029
C  2.547645 1.279783 0.351891
C  0.755645 -0.903332 0.065309
C  1.163587 1.504112 0.184021
C  -1.180918 0.739065 -0.083485
C  -6.006927 -0.300512 -0.673561
C  -2.220219 -0.1403 -0.203728
C  -3.616253 0.358923 -0.345699
C  -6.730117 0.05095 0.642673
C  4.705711 -0.931803 1.951723
C  3.526658 -2.862075 -0.798083
C  4.578975 2.538715 -0.258637
H  0.101658 -1.771749 -0.055799
H  0.811616 2.540904 0.168746
H  -1.456213 1.804095 -0.096064
H  -6.500676 -1.170078 -1.142282
H  -6.068301 0.565651 -1.358918
H  -2.057724 -1.226889 -0.199972
H  -4.299234 -1.614618 -0.503905
H  -7.78887 0.277926 0.434563
H  -6.254364 0.93903 1.102391
H  4.188082 -1.904797 2.021124
H  4.388034 -0.267946 2.776172
H  5.797167 -1.070431 1.974626
H  3.788192 -3.911227 -0.593044
H  3.034414 -2.782409 -1.785859
H  4.428935 -2.225506 -0.773335
H  5.035466 3.486921 0.063073
H  5.262334 1.692897 -0.079018
H  4.31462 2.59448 -1.332052
H  -5.831679 -1.250263 1.885684
