program: Gaussian 09
title: 000035267
version: EM64L-G09RevD.01
frameworkgroup: C1[X(C8H11Cl3N4S)]
method: RPBEPBE
basis: SDD
operation: Freq
keyword: #p
keyword: freq=noraman
keyword: PBEPBE/SDD
title: #p freq=noraman PBEPBE/SDD
converged: YES YES NO NO
title: Mulliken charges:
elementType: Cl Cl Cl S N N N N C C C C C C C C H H H H H H H H H H H
charge: 0.094687 0.121743 0.103564 0.261846 0.015902 -0.009662 -0.015144 -0.330037 -0.320208 -0.635796 -0.665718 -0.343843 0.304264 0.043494 -0.757881 -0.601010 0.297792 0.211374 0.259334 0.218218 0.221131 0.236615 0.221081 0.338941 0.256109 0.216116 0.257088
chargesum: 0.00000
title: Mulliken charges with hydrogens summed into heavy atoms:
elementType: Cl Cl Cl S N N N N C C C C C C C C
charge: 0.094687 0.121743 0.103564 0.261846 0.015902 -0.009662 -0.015144 0.008905 -0.022416 0.053130 0.013109 -0.343843 0.304264 0.043494 -0.757881 0.128302
polarizability: 2.27671175e+02 3.07735017e+01 1.77400611e+02 2.09925253e+00 -6.31026335e-01 1.11878516e+02
1716.lowfreq: -19.8125 -9.4842 -6.2912 -0.0028 -0.0027 -0.0020 4.5031 11.6183 33.1180
frequency: -19.6548 9.3800 32.9480 50.8943 70.1865 84.2822 107.3226 116.1038 155.3530 163.0829 188.5288 210.3286 217.1306 221.6687 237.0393 244.8058 262.4921 280.7932 290.9587 337.6817 357.3807 375.7410 403.1101 467.2721 505.6709 569.1912 573.9012 608.9744 624.2691 667.7805 700.5316 748.2411 750.4721 816.1700 868.5073 882.5568 896.2932 925.5767 948.9450 981.2886 1063.5673 1092.1277 1123.7733 1136.1083 1139.9757 1164.2677 1195.1654 1248.4330 1265.2577 1284.2984 1308.6041 1368.7693 1381.3672 1398.8137 1431.7742 1457.3720 1458.8351 1463.2093 1465.2745 1474.2691 1476.2126 1484.0314 1492.0184 1586.2897 2978.9217 2982.4606 2997.5009 3058.0891 3069.6534 3080.6778 3081.5305 3092.6522 3106.2657 3117.0631 3573.8908
redmass: 1.0309 15.7036 3.9056 2.8018 5.2466 9.1046 4.6459 4.7948 11.0909 6.3413 6.6464 1.0665 14.9664 5.2406 1.7455 3.4766 3.1337 4.3762 19.0575 4.0407 3.8631 22.8892 2.9472 9.6243 6.7678 1.1792 4.0448 13.0763 5.9787 9.4311 9.6793 11.8536 11.7673 12.2157 8.2167 2.7197 12.6463 1.1618 1.3760 4.7722 1.4126 2.8429 1.2850 2.2905 3.6168 1.9228 3.5713 1.9031 2.6284 5.2968 1.4067 3.3229 1.2154 1.2072 1.3965 1.0988 1.0401 3.0452 1.1246 1.9530 1.0484 1.0453 1.2118 5.1340 1.0371 1.0363 1.0342 1.0901 1.0984 1.1015 1.0953 1.0992 1.0997 1.1017 1.0775
irintensity: 0.1506 0.1133 2.4523 0.1762 1.1211 1.0820 1.0229 2.8219 0.5275 0.9697 0.5258 0.0835 0.2715 0.2328 0.4349 0.0147 0.3858 0.2803 0.0195 0.3258 0.9589 0.0745 0.9541 1.0918 38.2951 111.3552 9.2173 66.1209 17.6973 1.5710 76.3794 114.8407 126.0113 0.1753 5.5789 1.2611 16.3057 5.3004 0.0798 16.3237 65.2849 4.8276 1.5737 3.3369 83.8705 44.6314 143.1110 102.4667 10.5989 71.5981 5.9549 170.1778 24.3512 29.0775 79.0911 21.4920 16.5791 365.0310 30.8433 114.3740 13.2023 20.0651 59.4977 766.6517 18.1346 44.4623 48.7691 6.6922 2.0676 21.0796 34.7646 25.6654 22.0285 23.3158 88.3586
temp: 298.150 k
press: 1.00000 atm
elementType: 17 17 17 16 7 7 7 7 6 6 6 6 6 6 6 6 1 1 1 1 1 1 1 1 1 1 1
symmnumber: 1
zpe: 496757.5 jmol-1
zpe.correction: 0.189205 hartree
zpe.thermalcorrener: 0.207017 hartree
zpe.thermalcorrenthalpy: 0.207962 hartree
zpe.thermalcorrgfe: 0.140441 hartree
zpe.sumelectzpe: -2307.473371 hartree
zpe.sumelectthermal: -2307.455558 hartree
zpe.sumelectthermalent: -2307.454614 hartree
zpe.sumelectthermalfe: -2307.522135 hartree
dipole: -0.2754 2.7204 0.0263
dipole: 2.7344
quadrupole: -113.6727 -111.6990 -123.0228
quadrupole: 18.6324 0.6039 0.5796
quadrupole: 2.4588 4.4325 -6.8913 18.6324 0.6039 0.5796
hfenergy: -2307.6625757 hartree
pointgroup: C01[X(C8H11Cl3N4S1)]
dipole: 0.0219523 -1.0540188 -0.2142658 debye
polarizability: 232.2563104|26.3291803|169.8751584|2.8620992|13.0155218|114.8188333 unknown
InChI: InChI=1S/C8H11Cl3N4S/c1-4(2)16-7-14-5(8(9,10)11)13-6(12-3)15-7/h4,12H,1-3H3
charge 0 multiplicity 1
27 atoms
Cl -2.301933 1.55486 2.254326
Cl -0.169274 2.984747 0.669084
Cl -2.67622 2.053075 -0.715228
S  2.797496 -1.369517 -0.086718
N  0.543765 0.166198 0.260403
N  0.246454 -2.207569 -0.158101
N  -1.695096 -0.753389 0.153212
N  -1.931523 -3.058416 -0.264275
C  3.478862 0.406196 0.240809
C  3.465959 0.713911 1.74516
C  4.881599 0.450888 -0.387465
C  1.018457 -1.108347 0.020092
C  -0.807094 0.257428 0.31226
C  -1.114534 -1.983681 -0.085416
C  -1.426685 1.633655 0.602474
C  -3.397049 -2.976306 -0.218149
H  2.774418 1.068472 -0.288633
H  3.874881 1.728665 1.917183
H  2.438323 0.691749 2.14315
H  4.086259 -0.007389 2.306903
H  5.310211 1.460424 -0.244796
H  4.852053 0.238578 -1.470183
H  5.564559 -0.273875 0.092788
H  -1.461588 -3.948011 -0.437539
H  -3.743604 -2.623307 0.768761
H  -3.812533 -3.977953 -0.412377
H  -3.776761 -2.270688 -0.977223
