program: Gaussian 09
title: 000035277
version: EM64L-G09RevD.01
frameworkgroup: C1[X(C11H7Cl5N4S)]
method: RPBEPBE
basis: SDD
operation: Freq
keyword: #p
keyword: freq=noraman
keyword: PBEPBE/SDD
title: #p freq=noraman PBEPBE/SDD
converged: YES YES NO NO
title: Mulliken charges:
elementType: Cl Cl Cl Cl Cl S N N N N C C C C C C C C C C C H H H H H H H
charge: -0.017417 0.097808 0.137239 0.102027 -0.035042 0.349145 0.060973 -0.007683 -0.013506 -0.328641 -0.150123 -0.341013 0.304759 0.053529 -0.056980 -0.185836 -0.762728 -0.195670 -0.215349 -0.084660 -0.599860 0.263503 0.340925 0.285685 0.264583 0.217831 0.258729 0.257771
chargesum: 0.00000
title: Mulliken charges with hydrogens summed into heavy atoms:
elementType: Cl Cl Cl Cl Cl S N N N N C C C C C C C C C C C
charge: -0.017417 0.097808 0.137239 0.102027 -0.035042 0.349145 0.060973 -0.007683 -0.013506 0.012284 -0.150123 -0.341013 0.304759 0.053529 -0.056980 0.077667 -0.762728 0.090015 0.049234 -0.084660 0.134472
polarizability: 3.05379217e+02 -4.07943904e+01 1.89699610e+02 1.52460756e+01 4.93351722e+00 1.65785173e+02
1716.lowfreq: -32.0574 -5.3576 -0.5704 -0.0015 0.0002 0.0015 3.7706 6.1673 16.9073
frequency: -32.0543 5.2665 16.8649 20.6667 28.5486 79.7173 82.0471 102.7692 114.7461 135.0484 154.4683 165.4603 178.2413 188.2373 198.8181 217.8848 226.4519 239.8591 254.7491 283.8498 291.1059 346.3514 352.3106 373.6167 376.6532 422.1277 435.8903 460.5229 506.7441 533.5964 557.7943 572.8540 609.1277 619.0060 657.1071 666.5689 697.1977 699.5700 749.5600 752.9482 765.5389 819.4284 821.0409 861.1525 869.0213 896.7259 956.1921 978.6689 997.1495 1080.0107 1095.1791 1111.5279 1124.1111 1134.3439 1137.2076 1194.3531 1242.8234 1258.4108 1286.0455 1352.8090 1369.3067 1371.6515 1432.0875 1436.8448 1458.9771 1459.6777 1479.5614 1492.1185 1566.7021 1571.3904 1590.1445 2999.5065 3083.7115 3119.0174 3160.0574 3182.7391 3185.3342 3572.7295
redmass: 1.0201 25.0869 9.1049 15.1464 13.5879 9.5731 8.5946 5.4109 6.4025 6.5787 11.0170 6.5708 12.3630 17.4924 13.8127 17.3670 5.8536 14.5917 9.5424 9.6814 19.0509 9.6481 12.1507 8.3112 23.7633 8.1004 4.0649 6.5508 7.8649 8.9402 5.1666 1.1775 13.1146 6.2052 7.4542 9.1545 5.8451 6.1117 11.8632 11.5157 9.2428 8.9233 1.4024 8.5178 1.4186 13.4801 1.3588 4.8212 7.0865 2.1554 2.8966 3.5696 1.2856 2.8465 1.6549 3.2088 1.2957 7.8960 6.3492 3.7683 5.9781 3.1925 1.4695 2.3122 1.0449 3.5913 1.9090 1.3147 8.6657 7.0796 5.3483 1.0341 1.1016 1.1019 1.0895 1.0960 1.0948 1.0776
irintensity: 0.1090 0.0974 0.7745 0.3860 0.1000 0.4296 1.4540 0.9659 1.8035 1.0287 0.8814 0.1148 0.2855 0.8148 0.0554 0.2688 0.1527 0.6662 2.1465 0.8605 0.0058 0.1552 5.7937 1.7113 0.1351 2.5084 10.1526 4.2519 39.6738 2.5533 10.4136 109.8399 63.9586 18.1351 3.7178 1.5664 34.3944 43.6156 96.9686 141.3377 47.6974 1.7394 35.4834 7.2932 22.5603 13.4334 0.2404 23.0069 53.2970 49.2237 8.1843 21.1049 1.4608 88.5277 5.9704 120.2223 3.9264 166.5417 16.9248 11.1408 10.0953 176.3327 65.1704 127.9141 19.9063 401.5791 125.0392 63.4979 26.1155 74.9386 816.1551 48.0588 19.1414 23.0319 0.7856 0.5741 1.5932 98.9842
temp: 298.150 k
press: 1.00000 atm
elementType: 17 17 17 17 17 16 7 7 7 7 6 6 6 6 6 6 6 6 6 6 6 1 1 1 1 1 1 1
symmnumber: 1
zpe: 435964.9 jmol-1
zpe.correction: 0.166050 hartree
zpe.thermalcorrener: 0.186818 hartree
zpe.thermalcorrenthalpy: 0.187762 hartree
zpe.thermalcorrgfe: 0.110917 hartree
zpe.sumelectzpe: -3339.209387 hartree
zpe.sumelectthermal: -3339.188619 hartree
zpe.sumelectthermalent: -3339.187675 hartree
zpe.sumelectthermalfe: -3339.264520 hartree
dipole: 2.9645 -2.9870 -1.4301
dipole: 4.4447
quadrupole: -138.2962 -166.7538 -157.0758
quadrupole: -13.8780 2.8738 3.1613
quadrupole: 15.7457 -12.7119 -3.0339 -13.8780 2.8738 3.1613
hfenergy: -3339.3754371 hartree
pointgroup: C01 [X(C11H7Cl5N4S1)]
dipole: -1.1965469 1.2199743 -0.371331 debye
polarizability: 310.1907291|-32.0566814|187.9780489|-15.4831582|-2.2991889|162.695221 unknown
InChI: InChI=1S/C11H7Cl5N4S/c1-17-9-18-8(11(14,15)16)19-10(20-9)21-7-3-2-5(12)4-6(7)13/h2-4,17H,1H3
charge 0 multiplicity 1
28 atoms
Cl 1.467366 0.601793 2.548388
Cl -2.373925 -2.672846 -2.177131
Cl 0.219644 -2.716076 -0.639951
Cl -2.389818 -3.035639 0.835863
Cl 5.711191 -1.429143 -0.350877
S  0.641226 2.567811 -0.029846
N  -0.55411 0.09564 -0.323148
N  -2.959178 -0.193084 -0.340389
N  -1.991435 2.035485 -0.08052
N  -4.312974 1.720113 -0.110965
C  2.038654 1.378009 -0.095588
C  -0.784854 1.437293 -0.157703
C  -1.685158 -0.650668 -0.40228
C  -3.069778 1.172388 -0.180075
C  2.41321 0.572118 1.003935
C  2.813295 1.318146 -1.276718
C  -1.53864 -2.169663 -0.582665
C  3.524817 -0.2912 0.937643
C  3.938742 0.471038 -1.369572
C  4.271744 -0.322404 -0.2555
C  -5.54883 0.929856 -0.193385
H  2.523902 1.93448 -2.132917
H  -4.346734 2.733139 0.011987
H  3.795541 -0.916589 1.79141
H  4.531609 0.426147 -2.28652
H  -6.409567 1.6112 -0.103042
H  -5.591141 0.178972 0.614393
H  -5.6096 0.390883 -1.154625
