program: Gaussian 09
title: 000035270
version: EM64L-G09RevD.01
frameworkgroup: C1[X(C11H17Cl3N4S)]
method: RPBEPBE
basis: SDD
operation: Freq
keyword: #p
keyword: freq=noraman
keyword: PBEPBE/SDD
title: #p freq=noraman PBEPBE/SDD
converged: YES YES NO NO
title: Mulliken charges:
elementType: Cl Cl Cl S N N N N C C C C C C C C C C C H H H H H H H H H H H H H H H H H
charge: 0.097389 0.124171 0.097844 0.276967 0.031024 -0.009412 -0.015766 -0.330391 -0.360498 -0.347611 -0.347964 -0.354952 -0.668507 -0.694127 -0.342050 0.300494 0.046699 -0.756169 -0.601022 0.193409 0.194405 0.189380 0.188126 0.211219 0.212833 0.195844 0.195978 0.282585 0.285051 0.210090 0.210150 0.217158 0.338653 0.256557 0.215894 0.256550
chargesum: 0.00000
title: Mulliken charges with hydrogens summed into heavy atoms:
elementType: Cl Cl Cl S N N N N C C C C C C C C C C C
charge: 0.097389 0.124171 0.097844 0.276967 0.031024 -0.009412 -0.015766 0.008263 0.027316 0.029895 0.076087 0.036870 -0.100871 -0.056729 -0.342050 0.300494 0.046699 -0.756169 0.127978
polarizability: 2.98551091e+02 1.61147279e+01 1.92200450e+02 -7.04661854e-01 1.80131717e-01 1.33628652e+02
1716.lowfreq: -44.3838 -7.8909 -7.3362 -0.0013 0.0022 0.0024 0.9112 6.8815 15.2682
frequency: -44.3492 -7.3359 15.1271 22.5466 38.4392 55.0884 79.0336 81.9054 84.5225 109.6304 115.0220 126.7208 134.7938 147.6257 155.8493 182.7296 191.9015 217.2186 223.1790 225.0388 241.8043 255.2293 290.9462 304.6650 343.0969 375.6958 402.4035 437.2917 466.8174 512.4059 571.0484 610.2437 616.9261 668.2122 694.2439 700.9314 726.2803 740.0436 749.5962 751.1763 781.4073 817.2030 868.5754 869.1570 889.6340 895.3891 973.0211 980.9227 1006.0950 1032.5494 1063.0495 1070.5068 1077.6932 1091.7171 1116.1339 1124.8686 1140.2315 1190.2811 1193.4502 1224.5299 1236.1064 1253.9854 1265.9876 1277.7531 1284.2919 1288.6650 1295.7984 1316.1525 1348.8911 1354.8250 1367.6247 1388.8937 1432.1132 1439.3763 1458.9956 1462.8070 1464.5484 1465.6581 1473.7294 1473.8863 1476.0675 1481.9180 1488.7370 1492.3131 1586.5916 2954.7370 2961.0516 2969.6314 2971.9794 2980.6569 2992.8595 2997.8713 3009.1531 3028.2193 3044.1180 3046.8736 3068.5249 3072.0060 3081.0404 3116.7800 3122.7854 3574.3184
redmass: 1.0213 23.9112 4.4561 4.7589 1.7634 3.4894 2.1792 4.8389 6.1234 3.4953 4.9914 2.5042 2.1067 5.5289 11.0512 7.5897 5.7199 16.5263 5.4326 1.1253 8.6351 6.5191 19.1712 5.7964 6.9518 26.5051 4.0425 3.2526 9.8367 7.3429 1.1720 13.0174 6.0410 9.2911 6.3322 9.7304 1.0662 1.1004 10.7077 11.6694 1.1685 12.1784 1.3751 4.7809 1.8987 12.8719 1.1898 4.8239 3.8893 3.5763 2.7640 1.1186 2.2866 2.8670 2.4803 1.2849 3.9094 1.6883 3.5160 1.2584 1.3497 2.5638 1.9646 1.1702 4.3242 1.0590 1.0971 1.3809 1.4783 1.6233 3.2764 1.2157 1.4068 1.0970 1.0395 3.3393 1.1598 1.0790 1.1532 1.7362 1.0424 1.0803 1.0917 1.2049 5.1568 1.0589 1.0591 1.0586 1.0370 1.0590 1.0982 1.0341 1.1015 1.1039 1.0577 1.1044 1.1008 1.0992 1.1015 1.1017 1.1086 1.0775
irintensity: 0.0736 0.0481 0.4466 0.3149 0.6893 1.2270 0.6882 0.3781 1.3964 0.6583 1.8172 0.1130 0.2145 1.4213 0.5207 0.6955 0.0170 0.2519 0.2929 0.0068 0.3285 1.3226 0.0001 0.1228 0.4069 0.0656 1.2527 0.7235 1.6347 37.1352 113.4702 65.1907 25.6990 2.0379 4.7998 74.4991 12.7709 5.3458 110.9388 135.9532 2.0834 0.0346 0.8668 3.5617 4.0344 13.4563 1.0459 13.2093 0.5273 7.9331 3.1658 0.1280 0.5504 16.1292 15.8269 1.5413 83.6756 0.3247 160.0843 2.3599 0.1412 131.7113 3.6189 0.2702 81.7041 0.3587 0.2642 2.1737 1.8331 1.8106 174.3813 11.5119 78.2105 33.4999 16.2408 394.9320 31.0786 1.4975 15.1639 102.8824 12.6720 3.2373 23.6700 55.3351 787.2716 3.1990 2.5087 68.2047 36.1886 58.7747 0.0340 50.8180 0.0218 10.9455 9.4769 70.6638 96.9056 52.5864 21.2195 23.6002 15.4896 88.8362
temp: 298.150 k
press: 1.00000 atm
elementType: 17 17 17 16 7 7 7 7 6 6 6 6 6 6 6 6 6 6 6 1 1 1 1 1 1 1 1 1 1 1 1 1 1 1 1 1
symmnumber: 1
zpe: 717401.5 jmol-1
zpe.correction: 0.273244 hartree
zpe.thermalcorrener: 0.294442 hartree
zpe.thermalcorrenthalpy: 0.295386 hartree
zpe.thermalcorrgfe: 0.219426 hartree
zpe.sumelectzpe: -2425.138721 hartree
zpe.sumelectthermal: -2425.117523 hartree
zpe.sumelectthermalent: -2425.116579 hartree
zpe.sumelectthermalfe: -2425.192539 hartree
dipole: 0.2828 2.6857 -0.0618
dipole: 2.7013
quadrupole: -118.3629 -142.6092 -142.1429
quadrupole: 19.1978 -0.1604 -0.2323
quadrupole: 16.0087 -8.2375 -7.7713 19.1978 -0.1604 -0.2323
hfenergy: -2425.4119652 hartree
pointgroup: C01 [X(C11H17Cl3N4S1)]
dipole: 0.2062349 -1.0419429 0.0356931 debye
polarizability: 300.5830646|-6.2794705|190.1676616|0.6751424|-0.3760239|133.6294671 unknown
InChI: InChI=1S/C11H17Cl3N4S/c1-3-4-5-6-7-19-10-17-8(11(12,13)14)16-9(15-2)18-10/h15H,3-7H2,1-2H3
charge 0 multiplicity 1
36 atoms
Cl 3.232674 2.75417 -1.5672
Cl 0.638437 3.079389 -0.06574
Cl 3.21895 2.799578 1.467441
S  -0.681808 -2.066318 -0.018076
N  0.920876 0.161068 -0.026684
N  2.005916 -2.013302 0.005896
N  3.340885 0.035012 -0.006681
N  4.345213 -2.094327 0.031405
C  -4.35057 0.037609 0.011625
C  -5.813792 -0.457816 -0.038442
C  -3.324196 -1.121067 -0.044691
C  -6.845794 0.690034 0.050071
C  -1.883532 -0.588113 -0.011292
C  -8.305658 0.190252 -0.00346
C  0.908202 -1.219882 -0.011982
C  2.162534 0.704027 -0.024502
C  3.211679 -1.339578 0.009368
C  2.280075 2.236328 -0.045757
C  5.697317 -1.521551 0.039697
H  -4.193157 0.623312 0.94077
H  -4.169599 0.734283 -0.832823
H  -5.97886 -1.026628 -0.977144
H  -5.989637 -1.17141 0.793586
H  -3.49766 -1.803053 0.811546
H  -3.487995 -1.71319 -0.966783
H  -6.680782 1.255448 0.989854
H  -6.667687 1.40564 -0.778505
H  -1.673646 -0.003887 0.898499
H  -1.643213 0.032487 -0.888495
H  -8.519017 -0.501069 0.833711
H  -8.503836 -0.354368 -0.945985
H  -9.023343 1.028731 0.059463
H  4.204125 -3.105322 0.043179
H  5.870605 -0.90299 -0.858011
H  6.428971 -2.344945 0.06062
H  5.848719 -0.877355 0.923223
