program: Gaussian 09
title: 000035265
version: EM64L-G09RevD.01
frameworkgroup: C1[X(C6H7Cl3N4S)]
method: RPBEPBE
basis: SDD
operation: Freq
keyword: #p
keyword: freq=noraman
keyword: PBEPBE/SDD
title: #p freq=noraman PBEPBE/SDD
converged: NO NO NO NO
title: Mulliken charges:
elementType: Cl Cl Cl S N N N N C C C C C C H H H H H H H
charge: 0.101877 0.123422 0.102173 0.281792 0.029336 -0.025996 -0.007519 -0.575320 0.310627 -0.331801 -0.576754 -0.754809 0.034310 -0.662637 0.282595 0.282598 0.230276 0.230268 0.229386 0.347090 0.349085
chargesum: 0.00000
title: Mulliken charges with hydrogens summed into heavy atoms:
elementType: Cl Cl Cl S N N N N C C C C C C
charge: 0.101877 0.123422 0.102173 0.281792 0.029336 -0.025996 -0.007519 0.120856 0.310627 -0.331801 -0.011562 -0.754809 0.034310 0.027294
polarizability: 1.81077077e+02 2.71673569e+01 1.67815865e+02 -7.24922771e-03 8.48105095e-03 9.11792055e+01
1716.lowfreq: -14.2944 -5.7413 0.0021 0.0031 0.0032 6.5713 8.6179 37.9788 63.0079
frequency: -11.0667 37.8871 62.9542 72.6685 90.3926 140.3110 149.6006 179.9901 195.8446 213.9805 217.4491 238.8535 265.7302 286.3055 290.8158 319.4486 375.9674 437.4529 498.8574 548.6866 565.7418 571.7779 610.6782 626.9645 668.3358 693.4794 751.3208 751.9576 774.8468 819.0205 889.2525 899.4146 991.7101 993.9856 1045.6554 1046.9926 1066.7536 1204.3195 1233.5261 1258.2065 1291.3585 1306.6301 1397.4964 1429.0188 1447.3242 1455.6621 1471.4894 1482.8294 1523.8757 1621.1199 2987.1616 3050.9970 3083.3836 3084.6906 3130.1841 3545.3099 3703.2056
redmass: 13.8656 3.0890 2.5638 4.9505 7.5644 9.4493 11.9457 7.2836 9.6892 9.4496 18.5563 1.1057 5.0610 7.2278 20.2487 6.1212 27.0595 6.4708 6.3334 1.2182 1.0623 8.4935 10.3485 4.7384 11.2847 11.6071 10.9717 10.8552 1.1259 12.4729 10.6521 9.3956 3.0796 2.2738 1.2222 2.9487 2.2191 6.0091 1.2226 2.9871 1.8876 6.3613 1.2034 7.7760 1.1260 5.2555 1.0392 1.0485 2.6353 1.8320 1.0354 1.0600 1.0973 1.1013 1.1080 1.0446 1.1060
irintensity: 0.0599 0.9464 2.5797 1.0968 1.6823 2.1328 0.4243 3.6936 0.6267 2.0126 0.1859 0.0081 1.9869 1.1067 0.0066 0.5819 0.0841 1.1437 17.5337 290.5655 0.1552 19.0217 62.4927 1.2015 2.9165 96.8869 129.1178 122.3018 5.0768 0.0569 7.9690 17.4639 6.6257 22.9388 0.3125 27.6903 2.7702 152.2675 0.3840 169.5657 15.2222 46.9580 21.3636 238.3987 64.9972 290.5038 16.0254 8.5764 348.2416 552.9294 31.6129 3.7417 21.2355 15.3829 18.8925 153.4405 59.0713
temp: 298.150 k
press: 1.00000 atm
elementType: 17 17 17 16 7 7 7 7 6 6 6 6 6 6 1 1 1 1 1 1 1
symmnumber: 1
zpe: 353489.8 jmol-1
zpe.correction: 0.134637 hartree
zpe.thermalcorrener: 0.149104 hartree
zpe.thermalcorrenthalpy: 0.150048 hartree
zpe.thermalcorrgfe: 0.091680 hartree
zpe.sumelectzpe: -2229.029861 hartree
zpe.sumelectthermal: -2229.015394 hartree
zpe.sumelectthermalent: -2229.014450 hartree
zpe.sumelectthermalfe: -2229.072819 hartree
dipole: -1.6142 2.1102 -0.0002
dipole: 2.6568
quadrupole: -111.3434 -89.7724 -110.6113
quadrupole: 12.6029 -0.0073 0.0046
quadrupole: -7.4343 14.1366 -6.7023 12.6029 -0.0073 0.0046
hfenergy: -2229.1644983 hartree
pointgroup: C01 [X(C6H7Cl3N4S1)]
dipole: 0.4385974 0.9487966 -0.000388 debye
dipolederiv: -0.3896274 -0.0579082 -0.3165176 -0.0512374 -0.1832457 0.0013801 -0.2958405 0.0091698 -0.5901398 -0.3052844 0.2541745 -0.0013034 0.2683684 -0.505482 0.0020825 -0.0013422 0.0015586 -0.1350582 -0.3933909 -0.056242 0.3183855 -0.0495896 -0.1823211 -0.002932 0.2971029 -0.0110788 -0.5853272 -0.8538326 0.2894971 -0.0000902 0.1176273 -0.0394712 -0.0000423 0.0001425 -0.0000729 -0.0729886 -1.5740216 -0.1035961 -0.0002218 -0.6338375 -0.6946298 0.0004944 0.0007053 0.0003784 -0.0888857 -0.6484736 -0.1208239 0.0001607 0.2148312 -1.3986661 0.0004983 -0.0004703 0.0011017 -0.160726 -1.4081441 0.6719776 -0.000451 0.5428799 -0.9371412 0.0003283 -0.0004341 0.0005679 -0.2042887 -0.5302851 0.5957514 -0.0003532 0.6251945 -1.3325798 0.0004036 -0.0004626 0.000528 -0.6646952 1.052876 0.1239669 0.0003928 0.0185955 0.9018546 -0.0001485 0.0013937 0.0009096 -0.0494977 2.1258281 -0.373813 0.0001014 0.0005307 0.7561975 -0.0005028 -0.0003464 -0.0006344 0.0510577 0.1843569 -0.2066662 0.0000092 -0.3446505 0.3720181 -0.000004 0.0000917 -0.0000382 0.1163038 1.0480655 -0.2901926 -0.0006934 -0.200286 0.8986878 -0.0008056 -0.0010492 -0.0011442 1.3329791 1.1761265 -0.6689448 0.0005721 -0.6202799 1.9013941 -0.0009994 0.0005286 -0.0014827 0.2483399 -0.0346426 0.0156607 0.0000848 0.207305 -0.049415 -0.0000406 0.0000165 0.0000455 0.0746586 0.0179528 -0.0098182 0.0717857 0.0519266 -0.041751 0.0495628 0.0834967 0.03388 -0.0162849 0.0177437 -0.0098994 -0.0717803 0.0517983 -0.0417848 -0.0495143 -0.0835559 -0.0338205 -0.0160895 0.0408417 -0.0134887 0.0602978 -0.0988602 0.0837237 0.0922668 0.1029771 0.0631251 -0.0605162 0.0405874 -0.0136302 -0.0604454 -0.0990654 0.0836026 -0.0922754 -0.1030544 -0.0632154 -0.0601703 0.0140626 0.063567 0.0000394 0.1005324 -0.1348463 0.0000498 0.0000292 0.0000513 0.1234848 0.1589774 0.0175383 -0.0000339 -0.0499873 0.3174116 0.0000733 0.0000239 0.0000876 0.3821517 0.2602839 -0.1071103 0.0000608 -0.0517958 0.2264439 0.000125 0.0000474 0.0000834 0.3756925 unknown
polarizability: 192.0167713|-21.7558005|156.8761478|0.0006283|-0.0395814|91.1792288 unknown
InChI: InChI=1S/C6H7Cl3N4S/c1-2-14-5-12-3(6(7,8)9)11-4(10)13-5/h2,10H2,1H3
charge 0 multiplicity 1
21 atoms
Cl -2.889858 -1.446575 -1.52106
Cl -0.801732 -2.994979 0.007922
Cl -2.901113 -1.440807 1.51494
S  2.906435 0.808701 0.000208
N  0.409274 -0.324409 0.001374
N  -1.62519 0.991261 0.00009
N  0.550892 2.103672 -0.000455
N  -1.452072 3.327914 -0.001659
C  -0.939699 -0.176341 0.001096
C  1.106788 0.86293 0.000589
C  3.21714 -1.066362 0.00058
C  -1.807706 -1.445117 0.001112
C  -0.825519 2.11842 -0.000706
C  4.734403 -1.304532 -0.000452
H  2.724297 -1.481378 0.893041
H  2.723011 -1.481954 -0.890901
H  5.215242 -0.873332 -0.896589
H  5.216596 -0.872671 0.894639
H  4.930369 -2.392475 -0.000202
H  -0.89294 4.178202 -0.002269
H  -2.469418 3.35793 -0.0018
