program: Gaussian 09
title: 000035303
version: EM64L-G09RevD.01
frameworkgroup: C1[X(C9H11Cl6N5S)]
method: RPBEPBE
basis: SDD
operation: Freq
keyword: #p
keyword: freq=noraman
keyword: PBEPBE/SDD
title: #p freq=noraman PBEPBE/SDD
converged: YES YES NO NO
title: Mulliken charges:
elementType: Cl Cl Cl Cl Cl Cl S N N N N N C C C C C C C C C H H H H H H H H H H H
charge: 0.092797 0.136097 0.097382 0.095077 0.152210 0.115621 0.559968 -0.550811 -0.329365 -0.095496 -0.026938 -0.029663 -0.306191 0.188439 0.061230 -0.308182 -0.656666 0.276120 -0.712436 -0.760860 -0.672700 0.235459 0.257966 0.235655 0.234868 0.239365 0.221839 0.221216 0.341655 0.225097 0.227448 0.233802
chargesum: 0.00000
title: Mulliken charges with hydrogens summed into heavy atoms:
elementType: Cl Cl Cl Cl Cl Cl S N N N N N C C C C C C C C C
charge: 0.092797 0.136097 0.097382 0.095077 0.152210 0.115621 0.559968 -0.550811 0.012289 -0.095496 -0.026938 -0.029663 0.187234 0.188439 0.061230 0.162341 0.025753 0.276120 -0.026089 -0.760860 -0.672700
polarizability: 2.78959709e+02 -2.32815450e+01 2.34870866e+02 1.44709276e+01 -1.68596502e+00 1.61731223e+02
1716.lowfreq: -9.8983 -3.6182 -0.0018 0.0013 0.0027 2.1848 5.2141 14.7149 22.7225
frequency: -9.6416 14.6999 22.6566 34.3757 45.8494 48.0321 67.5314 76.3604 83.0492 98.7166 125.0164 128.5574 141.9630 176.4382 186.4048 198.3563 201.4463 210.8931 216.9192 223.8028 239.6747 262.0734 265.0712 273.1899 296.0109 298.2709 302.9167 313.2305 358.3318 366.7803 385.0319 425.2765 450.1303 503.2239 549.6819 561.4230 617.9135 637.6060 643.1854 655.1803 675.2576 703.0700 711.2150 744.1746 756.1180 774.0300 798.3720 813.7901 816.7984 894.2130 904.6411 927.0073 998.0934 1028.0919 1081.8402 1084.9337 1108.8930 1144.9235 1159.0231 1168.2373 1221.3782 1262.4857 1282.2746 1300.9176 1340.0892 1345.3397 1382.1478 1385.5743 1402.4559 1413.9695 1444.8317 1466.7927 1469.7115 1479.3509 1479.4504 1482.5385 1493.9845 1505.6537 1577.5916 2987.9067 2988.3758 2990.1505 3034.7200 3040.0225 3082.9670 3084.4924 3091.2123 3098.0168 3114.3526 3556.1159
redmass: 29.3939 22.9901 7.1573 13.9696 3.0460 2.9413 3.1715 5.3049 4.3647 7.1007 7.8642 4.8178 18.2245 6.5470 7.9223 4.1046 4.8551 4.1602 2.1785 5.8054 8.2406 6.6338 1.7871 6.1414 8.2262 8.3713 7.2824 5.4316 4.0487 18.6761 18.4151 6.3530 8.9271 5.0099 5.1645 1.1528 11.0421 12.1997 8.3014 11.3792 7.9070 12.1052 10.6572 2.1969 9.0905 8.3446 1.1178 1.9692 11.6850 13.6103 2.5185 2.2686 3.7388 4.3274 2.3416 2.4336 4.5507 1.5215 2.7639 2.6941 4.3915 1.1067 4.7898 1.3587 1.6216 1.3013 2.2726 1.2642 1.2638 2.8235 2.3705 1.2804 1.1988 1.0401 1.0542 1.1351 1.3413 2.3372 7.2121 1.0355 1.0405 1.0562 1.1030 1.0605 1.0994 1.1013 1.1001 1.0986 1.1048 1.0773
irintensity: 0.0632 0.0579 0.2104 0.0356 0.0568 0.0701 0.9773 0.1783 0.5122 0.3954 1.0195 2.9348 0.4494 0.7242 1.1062 0.1287 1.5653 0.8397 0.9727 0.0573 0.2350 0.2917 0.6129 0.8093 1.1066 2.3961 1.9307 1.8335 0.3707 2.5440 12.8391 22.3812 18.3012 12.6445 2.2859 91.3307 40.6803 167.5527 47.4990 66.1292 65.3290 106.1946 7.9326 131.8686 133.9146 71.4052 4.0123 14.2876 0.8220 18.3450 7.4839 27.5861 47.3178 6.4743 9.5945 6.4173 19.7445 1.8838 7.0651 22.4253 25.9957 1.1526 4.4380 29.6166 55.6832 49.2019 8.5334 29.1390 91.1358 607.8220 151.5631 164.7886 54.2192 14.6866 4.2274 55.0740 239.8412 389.5261 620.7045 22.5583 27.8078 24.4290 10.2864 8.1339 21.4630 42.5707 19.3178 26.6017 15.1466 87.5635
temp: 298.150 k
press: 1.00000 atm
elementType: 17 17 17 17 17 17 16 7 7 7 7 7 6 6 6 6 6 6 6 6 6 1 1 1 1 1 1 1 1 1 1 1
symmnumber: 1
zpe: 537140.4 jmol-1
zpe.correction: 0.204586 hartree
zpe.thermalcorrener: 0.228429 hartree
zpe.thermalcorrenthalpy: 0.229373 hartree
zpe.thermalcorrgfe: 0.147441 hartree
zpe.sumelectzpe: -3780.097879 hartree
zpe.sumelectthermal: -3780.074037 hartree
zpe.sumelectthermalent: -3780.073092 hartree
zpe.sumelectthermalfe: -3780.155024 hartree
dipole: -1.5568 6.8064 0.2539
dipole: 6.9867
quadrupole: -166.3644 -159.7068 -170.3852
quadrupole: -15.0440 6.1910 -0.2107
quadrupole: -0.8789 5.7787 -4.8997 -15.0440 6.1910 -0.2107
hfenergy: -3780.3024651 hartree
pointgroup: C01 [X(C9H11Cl6N5S1)]
dipole: -0.2137567 -2.5191723 1.078877 debye
polarizability: 254.7930755|-38.2762424|249.4086102|-15.7230712|-19.1750737|171.3601121 unknown
InChI: InChI=1S/C9H11Cl6N5S/c1-3-16-6-17-5(8(10,11)12)18-7(19-6)20(4-2)21-9(13,14)15/h16H,3-4H2,1-2H3
charge 0 multiplicity 1
32 atoms
Cl 2.689567 1.78764 -2.83612
Cl 1.476704 3.688006 -0.831845
Cl 4.005071 2.206308 -0.134208
Cl -4.687833 0.587881 -0.688827
Cl -2.302554 1.782767 -2.088696
Cl -4.154058 3.580235 -0.466913
S  -2.362883 1.795376 1.048481
N  -1.639946 0.173332 0.949101
N  2.053628 -2.578704 -0.012816
N  0.182893 -1.245018 0.503956
N  0.317019 1.133521 0.001256
N  2.201826 -0.30018 -0.501916
C  -2.360314 -0.967366 1.584568
C  -0.3384 0.016434 0.467932
C  1.458077 -1.353999 0.000001
C  1.413297 -3.814562 0.470933
C  -2.011182 -1.121379 3.076443
C  1.567892 0.894807 -0.460799
C  2.396439 -4.992911 0.38583
C  2.364651 2.085635 -1.017195
C  -3.345757 1.898631 -0.56909
H  -3.439167 -0.793302 1.444749
H  -2.075266 -1.873867 1.025866
H  1.073467 -3.661605 1.512414
H  0.506368 -4.018143 -0.130568
H  -0.932762 -1.31503 3.206354
H  -2.281618 -0.213009 3.64434
H  -2.570262 -1.972709 3.505917
H  2.998865 -2.60953 -0.400576
H  2.723238 -5.17108 -0.655229
H  3.291621 -4.814898 1.009086
H  1.911179 -5.915378 0.747372
