program: Gaussian 09
title: 000035248
version: EM64L-G09RevD.01
frameworkgroup: C1[X(C4H3ClN6)]
method: RPBEPBE
basis: SDD
operation: Freq
keyword: #p
keyword: freq=noraman
keyword: PBEPBE/SDD
title: #p freq=noraman PBEPBE/SDD
converged: NO YES NO NO
title: Mulliken charges:
elementType: Cl N N N N N N C C C C H H H
charge: 0.002477 -0.095979 -0.019359 -0.000154 -0.574554 0.081201 0.017535 0.138640 0.059574 -0.260887 -0.337117 0.298255 0.347587 0.342781
chargesum: 0.00000
title: Mulliken charges with hydrogens summed into heavy atoms:
elementType: Cl N N N N N N C C C C
charge: 0.002477 -0.095979 -0.019359 -0.000154 0.115814 0.081201 0.017535 0.138640 0.059574 -0.260887 -0.038862
polarizability: 1.56547140e+02 -2.02101976e+01 1.22607852e+02 -1.61769388e-02 2.17774878e-02 3.70424725e+01
1716.lowfreq: -2.0642 -1.7650 -0.0029 -0.0028 -0.0026 4.3853 81.9113 94.1098 149.8010
frequency: 81.9106 94.1093 149.8007 174.7942 214.1192 241.9322 276.1173 393.7755 428.2603 476.5337 506.7742 533.9736 558.4086 562.7028 580.6914 654.4459 703.2840 714.2154 802.8026 869.9713 911.0224 954.2998 1025.3186 1147.5083 1240.1196 1249.3791 1283.0620 1403.2038 1443.1699 1501.2455 1525.1024 1621.0164 2067.9307 3205.7907 3550.1080 3708.1420
redmass: 7.3623 14.6214 9.8401 7.2484 5.6846 9.5832 4.6568 15.9170 9.1464 4.7704 6.9268 1.2132 1.1181 7.8370 1.5098 7.1661 7.0647 5.5157 11.0721 10.5941 7.4034 6.8539 2.2425 2.3737 6.1600 5.4988 2.3358 8.1946 5.6534 8.0887 2.4723 1.8594 13.4019 1.0902 1.0446 1.1059
irintensity: 0.4097 0.1201 2.7558 0.2828 8.6454 0.0682 8.2982 8.1503 0.7801 8.0204 0.2899 240.2225 41.8512 7.7779 64.5341 19.3660 45.8506 2.5569 36.2674 13.8614 35.9145 18.0491 12.8681 1.2391 9.1171 226.8448 15.1708 228.4564 227.5118 1143.0477 171.3941 454.8048 440.4223 11.4636 153.1965 58.5976
temp: 298.150 k
press: 1.00000 atm
elementType: 17 7 7 7 7 7 7 6 6 6 6 1 1 1
symmnumber: 1
zpe: 220442.1 jmol-1
zpe.correction: 0.083962 hartree
zpe.thermalcorrener: 0.093545 hartree
zpe.thermalcorrenthalpy: 0.094489 hartree
zpe.thermalcorrgfe: 0.048217 hartree
zpe.sumelectzpe: -941.975384 hartree
zpe.sumelectthermal: -941.965801 hartree
zpe.sumelectthermalent: -941.964857 hartree
zpe.sumelectthermalfe: -942.011129 hartree
dipole: 0.3234 -5.0312 0.0004
dipole: 5.0416
quadrupole: -62.1500 -64.3503 -70.2132
quadrupole: -3.9988 0.0086 -0.0056
quadrupole: 3.4212 1.2208 -4.6420 -3.9988 0.0086 -0.0056
hfenergy: -942.0593459 hartree
pointgroup: C01 [X(C4H3Cl1N6)]
dipole: -0.4746612 -1.9258691 0.0009096 debye
dipolederiv: -0.1453937 0.1207728 -0.00005 0.2189343 -0.9560568 0.0003812 -0.0001747 0.0006543 -0.0869814 -1.7690162 -0.3408289 0.0002244 -0.0764872 -0.6019809 0.0000968 -0.0006065 0.0001098 -0.2152365 -1.2447069 0.4979117 -0.0002665 0.7243693 -1.1440686 0.0002887 -0.000554 0.0005344 -0.1381147 -0.9185544 -0.3627554 0.0001691 -0.3876854 -1.3408104 0.0004116 -0.0001669 0.0004498 -0.1723425 -1.2049109 -0.6695494 0.0003271 -0.7097826 -0.6869402 -0.0000886 0.0002045 -0.000172 -0.696914 1.6363552 0.3924402 -0.000339 1.3296414 0.2438943 -0.000043 -0.0055643 -0.0009257 0.1639604 -1.0977683 -0.1299635 -0.0004434 -0.7671377 -0.1292974 -0.0004046 0.0048058 0.0007049 -0.0524088 2.127331 -0.0019204 -0.0003046 -0.5152205 0.8857125 -0.0001521 0.0004367 -0.0005092 0.1729557 1.9973775 0.6756714 -0.0002784 0.5652803 1.2508522 -0.0002564 0.0002468 -0.0002224 0.2354314 1.4464708 -0.1618169 0.0001773 -0.2749126 2.0253138 -0.0008527 0.0006229 -0.0011594 0.0715048 -1.4141591 -0.1234042 0.0010661 -0.2376374 -0.0920811 0.0004272 0.0009814 0.0005145 -0.3231907 0.0652327 0.0058598 -0.0001677 0.021202 0.1094576 0.0000349 -0.000165 -0.0001522 0.2582506 0.3182764 0.0594513 -0.0000532 0.0013442 0.1695309 0.0001036 -0.0000068 0.0000981 0.3916511 0.203466 0.0381314 -0.0000612 0.1080919 0.266474 0.0000534 -0.00006 0.0000752 0.3914347 unknown
polarizability: 162.5129516|13.0531404|116.6419857|-0.0511077|-0.0614094|37.0425269 unknown
InChI: InChI=1S/C4H3ClN6/c5-3-9-2(1-8-7)10-4(6)11-3/h1H,6H2
charge 0 multiplicity 1
14 atoms
Cl -1.144437 3.049177 -0.000825
N  -0.569602 -1.443192 0.001449
N  0.362843 0.818021 0.000714
N  -2.041343 0.514009 0.000358
N  -2.905677 -1.664069 0.001103
N  2.878505 -0.34184 0.001296
N  3.816309 0.368338 -0.002995
C  0.481584 -0.566142 0.001252
C  -1.809163 -0.852368 0.000945
C  -0.913578 1.248695 0.00043
C  1.810496 -1.131563 0.001792
H  1.96948 -2.209528 0.001845
H  -3.832105 -1.243308 0.000756
H  -2.779212 -2.67333 0.001579
