program: Gaussian 09
title: 000039038
version: EM64L-G09RevD.01
frameworkgroup: C1[X(C10H9NO)]
method: RPBEPBE
basis: SDD
operation: Freq
keyword: #p
keyword: freq=noraman
keyword: PBEPBE/SDD
title: #p freq=noraman PBEPBE/SDD
converged: YES YES NO NO
title: Mulliken charges:
elementType: O N C C C C C C C C C C H H H H H H H H H
charge: -0.470079 -0.688645 0.308204 0.437950 -0.048459 0.333392 -0.472698 -0.365498 -0.433208 -0.405883 -0.267415 -0.255434 0.234160 0.181876 0.239769 0.219651 0.224168 0.225844 0.301873 0.339409 0.361025
chargesum: 0.00000
title: Mulliken charges with hydrogens summed into heavy atoms:
elementType: O N C C C C C C C C C C
charge: -0.109055 -0.047363 0.308204 0.437950 -0.048459 0.333392 -0.238538 -0.183622 -0.193439 -0.186232 -0.043246 -0.029590
polarizability: 1.95532462e+02 -8.47966328e+00 1.30393842e+02 -3.00873884e-04 1.06396467e-02 4.71251330e+01
1716.lowfreq: -0.0006 -0.0005 0.0002 10.0183 12.1293 16.3457 93.4655 118.0478 206.1960
frequency: 93.4512 118.0457 206.1839 229.8561 267.2267 308.3919 308.4750 340.3426 416.9926 431.2572 467.0604 482.8850 516.4408 521.0951 555.5321 578.2167 670.7838 682.3749 727.3583 738.9499 776.9766 803.6065 849.6144 851.3013 930.2694 937.9521 949.3233 976.2876 1020.7547 1032.0760 1079.0191 1140.6917 1159.3766 1176.0875 1234.4295 1254.0164 1273.9131 1341.5103 1376.4266 1412.9752 1428.8261 1447.1078 1486.2711 1525.5610 1585.1700 1609.7485 1620.8363 1652.9736 3083.6562 3119.6161 3120.9212 3137.5867 3146.1148 3160.8523 3566.8069 3614.8553 3715.3026
redmass: 1.9221 4.3355 1.6241 4.6342 4.1195 3.5438 2.0735 1.7353 2.8761 6.4113 5.5465 1.2025 4.5610 2.5489 3.3630 6.2008 3.4990 5.8883 6.0538 1.3357 2.9119 1.5149 4.9681 1.6990 1.3288 3.1621 1.4058 1.3480 2.2526 1.9692 2.1129 1.5556 1.2057 1.0917 1.7799 1.4705 2.0682 2.2444 2.2934 4.2104 3.6517 5.3512 3.1772 4.0159 7.2992 1.9307 2.0870 6.2097 1.0876 1.0872 1.0867 1.0927 1.0973 1.0997 1.0443 1.0658 1.1046
irintensity: 26.6241 10.4911 87.7135 3.2226 0.9804 22.0758 92.7813 105.5015 20.2426 0.7662 1.8678 83.2812 3.6722 41.4124 5.8391 6.1827 0.8147 6.6954 3.7010 58.1887 4.3509 84.9301 5.4661 9.7263 0.4045 7.8686 3.2007 0.6236 1.8172 12.8370 166.8251 63.3494 25.4807 1.4276 7.2439 95.9230 6.1280 49.7549 52.5288 4.3083 15.9240 18.6012 54.2661 52.7072 5.9679 30.5368 93.8868 265.5954 24.0008 3.5871 8.9756 27.3001 29.5387 31.5900 111.1626 24.7496 33.8116
temp: 298.150 k
press: 1.00000 atm
elementType: 8 7 6 6 6 6 6 6 6 6 6 6 1 1 1 1 1 1 1 1 1
symmnumber: 1
zpe: 432209.2 jmol-1
zpe.correction: 0.164620 hartree
zpe.thermalcorrener: 0.174631 hartree
zpe.thermalcorrenthalpy: 0.175575 hartree
zpe.thermalcorrgfe: 0.129842 hartree
zpe.sumelectzpe: -515.612717 hartree
zpe.sumelectthermal: -515.602706 hartree
zpe.sumelectthermalent: -515.601762 hartree
zpe.sumelectthermalfe: -515.647495 hartree
dipole: -1.0856 -0.3208 0.0034
dipole: 1.1320
quadrupole: -56.0078 -58.0999 -77.0543
quadrupole: -3.3399 -0.0438 0.0272
quadrupole: 7.7128 5.6208 -13.3336 -3.3399 -0.0438 0.0272
hfenergy: -515.777337 hartree
pointgroup: C01 [X(C10H9N1O1)]
dipole: -0.4234511 -0.1378292 0.006574 debye
dipolederiv: -0.2357423 -0.3026146 0.0045193 -0.4353433 -1.210003 0.021522 0.0085019 0.0228302 -0.4148741 -1.700876 -0.1655675 0.0065168 -0.455595 -0.1519258 -0.0114624 0.0094238 -0.0126098 -0.7326691 0.5006665 -0.111175 0.0008935 0.1470699 -0.2083022 0.0051169 -0.0052172 0.0068246 0.0292981 -0.253658 0.0847598 -0.0008492 -0.3111395 -0.1302388 0.0056157 0.0086314 0.0039014 0.0423313 -0.5675032 0.1217668 -0.0001822 0.6655669 1.0948405 -0.0304017 -0.0124391 -0.0282933 -0.0403663 1.7865929 0.3321363 -0.0150463 0.2508156 -0.2288554 0.0070004 -0.014068 0.0055598 0.1113467 0.1020531 -0.1982012 0.003448 0.0288933 0.079873 -0.0068085 -0.0021705 -0.0060124 -0.1926823 -0.188172 -0.0746767 0.0014533 0.0653548 0.074007 -0.0073005 -0.0021391 -0.0070076 -0.2062433 0.2775424 -0.1151966 0.0008153 0.049774 0.1489374 -0.0078937 -0.0030408 -0.0072726 -0.1647391 -0.1944704 0.0874413 -0.0019906 -0.3114675 0.194785 -0.008092 0.0076119 -0.0097733 -0.199792 0.0239445 0.0219053 -0.0011708 -0.0434384 0.1973934 -0.0085474 0.0004449 -0.0089756 -0.1560522 -0.1148814 0.1384862 -0.0037857 0.1291125 -0.1920399 -0.0007812 -0.0036095 -0.0007385 -0.2002728 0.0630775 -0.0821371 0.0024508 -0.0195754 -0.0973195 0.0063902 0.0009808 0.0067426 0.1614207 0.0457156 -0.1120746 0.0031852 -0.0390672 -0.1581709 0.0079747 0.0014437 0.0085407 0.1582533 0.0669817 -0.0117665 0.0006801 -0.0850937 -0.1084652 0.0067921 0.0024843 0.0064989 0.1537704 -0.0684678 0.1242781 -0.001963 0.0950055 -0.0026124 0.0035309 -0.0011443 0.0034828 0.1630655 -0.0368545 0.113443 -0.0019123 0.1273459 -0.0278997 0.0040973 -0.0023507 0.0041436 0.1608466 -0.1374118 -0.0548021 0.002723 -0.0554966 0.0708157 0.0026915 0.0027722 0.0027209 0.1708077 0.2482471 0.0102963 0.0010263 -0.0160341 0.1282474 0.0057213 0.004133 0.0053033 0.3880336 0.2271874 0.028832 0.0004691 0.1005644 0.1804713 0.0049437 0.0002092 0.0056665 0.3948868 0.1560287 0.1648669 -0.0012807 0.1127477 0.3464622 -0.0001094 -0.0004578 -0.0015322 0.3736306 unknown
polarizability: 195.9472991|-6.6856969|129.9297028|-0.5144022|-1.9570414|47.1744344 unknown
InChI: InChI=1S/C10H9NO/c11-9-6-5-7-3-1-2-4-8(7)10(9)12/h1-6,12H,11H2
charge 0 multiplicity 1
21 atoms
O  -1.581579 -2.121915 0.080871
N  -3.42873 -0.182303 0.042421
C  0.303846 -0.466338 0.032208
C  0.683558 0.936971 -0.003318
C  -1.086595 -0.793024 0.046186
C  -2.091205 0.198941 0.027126
C  -0.344611 1.933471 -0.022683
C  1.346649 -1.456686 0.051869
C  2.073618 1.279938 -0.017884
C  -1.692403 1.576251 -0.008018
C  2.693167 -1.08568 0.036957
C  3.065453 0.295744 0.001602
H  -0.058219 2.990906 -0.049706
H  1.105658 -2.5289 0.079794
H  2.349112 2.341368 -0.045095
H  -2.47102 2.348417 -0.023306
H  3.471704 -1.856485 0.052546
H  4.124637 0.57378 -0.009958
H  -4.171502 0.508565 0.033811
H  -3.656956 -1.17235 0.069424
H  -0.846281 -2.77987 0.087953
