program: Gaussian 09
title: 000039035
version: EM64L-G09RevD.01
frameworkgroup: C1[X(C11H8O6)]
method: RPBEPBE
basis: SDD
operation: Freq
keyword: #pfreq=noraman
keyword: PBEPBE/SDD
title: #p freq=noraman PBEPBE/SDD
converged: NO YES NO NO
title: Mulliken charges:
elementType: O O O O O O C C C C C C C C C C C H H H H H H H H
charge: -0.336630 -0.420079 -0.367167 -0.451640 -0.315469 -0.341286 0.176903 0.258195 -0.015899 -0.039135 0.009246 0.441815 0.136721 -0.030225 0.016426 -0.549532 -0.775331 0.273014 0.223174 0.253739 0.253758 0.392362 0.400920 0.395102 0.411020
chargesum: 0.00000
title: Mulliken charges with hydrogens summed into heavy atoms:
elementType: O O O O O O C C C C C C C C C C C
charge: 0.055732 -0.019159 0.027934 -0.040620 -0.315469 -0.341286 0.176903 0.258195 -0.015899 -0.039135 0.009246 0.441815 0.136721 -0.030225 0.016426 -0.276518 -0.044660
polarizability: 2.35365706e+02 -5.92607070e-01 1.91092712e+02 -8.54909266e-03 1.64178665e-03 5.85827608e+01
1716.lowfreq: -0.0001 0.0002 0.0007 7.8622 10.0096 11.2877 72.7882 104.4459 116.2067
frequency: 72.7875 104.4404 116.1960 147.5450 158.7467 178.8025 213.7648 239.7227 253.4222 278.4798 292.1532 329.6519 335.0140 367.8461 378.6916 380.3221 425.7748 427.5753 449.5272 480.0679 497.6225 520.3784 539.9403 557.2332 596.1794 630.3957 666.3779 692.6009 735.2736 745.6036 799.2265 825.8137 897.1396 939.3795 968.1352 991.8671 1005.8267 1028.4797 1046.4093 1070.8357 1134.4193 1187.7723 1204.1746 1231.4297 1257.7160 1288.4168 1320.6836 1342.7559 1397.7566 1403.0315 1420.6491 1422.8371 1444.8879 1454.0942 1461.6407 1488.7468 1524.4392 1556.9456 1597.1078 1607.8319 1643.2081 2337.7425 2504.2511 2989.8742 3066.5444 3107.7479 3151.9111 3514.1412 3529.6497
redmass: 4.3651 2.4145 1.7040 7.9442 6.0577 9.9310 4.3294 5.0522 4.8075 5.0859 4.5808 8.1116 4.5589 8.2097 10.3538 6.1352 5.4840 8.4555 11.9700 1.1302 1.1159 9.3588 9.9749 8.5010 6.6077 6.0189 4.7817 6.0914 6.2699 5.6952 10.1520 6.8250 1.4674 5.6876 4.7943 1.0640 1.8159 1.0602 1.5627 2.9858 4.6676 1.7916 1.8913 3.2663 1.8170 4.3073 2.4190 2.9651 1.5036 3.9614 4.8161 5.3276 1.0450 1.2013 2.8016 5.6769 5.2960 4.1301 3.0947 4.2354 7.4024 1.0790 1.0771 1.0371 1.0954 1.1010 1.0925 1.0653 1.0654
irintensity: 4.0926 0.1282 0.2154 0.4276 0.0746 0.0000 5.8563 0.3049 3.5285 9.4359 8.0853 2.9846 9.1133 0.1756 2.3281 6.0983 0.6344 9.4329 29.2928 260.8133 61.6108 5.5888 1.5182 0.0444 5.4908 1.4545 3.2693 1.5409 1.2043 72.0888 0.4099 6.7352 23.7676 40.8300 55.1789 124.1601 80.7043 134.1590 22.0577 37.3783 81.1741 35.2311 161.6550 66.3463 579.6021 11.5626 294.8829 37.2637 205.6422 181.4160 166.7322 76.1550 14.9148 47.8484 126.8243 181.7629 90.3569 93.6089 32.3873 12.3788 15.2648 121.5919 83.0666 6.9258 7.0867 18.0102 7.1625 137.4611 137.2943
temp: 298.150 k
press: 1.00000 atm
elementType: 8 8 8 8 8 8 6 6 6 6 6 6 6 6 6 6 6 1 1 1 1 1 1 1 1
symmnumber: 1
zpe: 448466.0 jmol-1
zpe.correction: 0.170812 hartree
zpe.thermalcorrener: 0.185172 hartree
zpe.thermalcorrenthalpy: 0.186117 hartree
zpe.thermalcorrgfe: 0.130684 hartree
zpe.sumelectzpe: -874.125856 hartree
zpe.sumelectthermal: -874.111495 hartree
zpe.sumelectthermalent: -874.110551 hartree
zpe.sumelectthermalfe: -874.165984 hartree
dipole: -0.1072 1.8014 0.0019
dipole: 1.8046
quadrupole: -77.9366 -115.9013 -97.6171
quadrupole: 3.3079 -0.0036 -0.0022
quadrupole: 19.2150 -18.7497 -0.4654 3.3079 -0.0036 -0.0022
hfenergy: -874.2966672 hartree
pointgroup: C01 [X(C11H8O6)]
dipole: 0.0753191 -0.705975 0.0007354 debye
dipolederiv: -0.194962 -0.2266034 0.0000965 0.3363596 -1.1663032 -0.0001411 0.0000576 -0.0001727 -0.3399256 -0.5501506 -0.1797388 0.0000767 -0.5934483 -1.0567339 0.0000375 0.0000141 0.0000487 -0.3746051 -1.1713293 0.801164 -0.0000579 0.7176756 -0.5555285 0.0000669 -0.0000467 0.0000449 -0.3673907 -1.3701343 -0.5638625 -0.0000842 -0.5187107 -0.3594191 -0.0000455 -0.0000691 -0.0000229 -0.4026504 -0.5567335 -0.0881186 -0.0000385 -0.7813734 -0.9197946 0.0000472 0.0001699 0.0001035 -0.3342431 -0.3840112 -0.2052745 -0.0000324 0.4609774 -1.2269161 0.0000077 0.0000473 -0.0000192 -0.3627671 -1.0346741 -0.0751523 -0.0000178 0.0010018 -0.1276434 -0.000029 -0.0000136 0.000042 0.0040318 -1.0361152 0.3381613 -0.0000433 0.3458473 -0.2549474 0.0000406 -0.0000847 -0.0000124 -0.0143443 0.7535815 -0.0183038 0.0000264 0.7221277 0.8721783 -0.000115 -0.000142 -0.0001814 0.1174954 0.1859435 0.6879626 0.0000245 -0.4142591 1.1259456 0.0001512 0.0000023 0.0002596 0.0853747 0.3458689 -0.3622163 0.0000078 0.6142599 1.0671514 -0.0000667 -0.0000717 -0.0001407 0.0851931 0.6429562 0.3496317 0.0000304 0.1805025 0.029717 0.0000593 0.0000153 -0.0000727 -0.0029448 0.9315819 0.192127 0.0000853 -0.5245478 1.1492283 0.0000091 0.0000468 0.000072 0.1829492 1.0711925 -1.0479964 0.0000435 -0.8741101 0.3503433 -0.0000871 0.0000929 -0.0001387 0.0582813 1.2205085 0.7552799 0.0000759 0.625045 -0.2102496 0.000078 0.0001424 0.0000797 0.023884 -0.1329892 -0.3896749 -0.0000178 -0.3174181 -0.1689603 -0.0000504 -0.0000208 0.0000562 -0.1537737 -0.2203709 -0.1463652 -0.0000165 -0.2848424 -0.062603 -0.0000093 0.0000191 0.0000248 0.0213325 -0.0162948 0.0493155 -0.0000198 0.0858531 0.0469217 0.0000077 -0.0000173 -0.0000091 0.1548017 -0.0389302 0.0441625 -0.0000106 0.1705925 -0.0288384 0.0000107 -0.0000115 0.000008 0.1120194 0.0617562 -0.0094422 0.0078775 -0.0066495 0.0742447 -0.0939167 -0.0343369 -0.0824429 -0.0056635 0.0617614 -0.0094637 -0.0078709 -0.0066445 0.0742753 0.0939021 0.034329 0.082421 -0.0056306 0.1812485 -0.0138721 -0.0000858 0.0441586 0.4501747 0.0000789 -0.0000966 0.0000749 0.35231 0.3096726 0.1550613 -0.0000574 0.0127712 0.4324267 -0.0000314 -0.0000493 -0.000016 0.3595326 0.449823 -0.1872593 0.0000007 -0.1463293 0.1975012 -0.0000184 0.0000074 -0.0000254 0.3968876 0.4908004 0.1504781 0.0000078 0.1511611 0.2678291 0.0000136 0.0000159 0.0000188 0.4098456 unknown
polarizability: 235.3240364|1.4813157|191.1343815|0.0086166|-0.0012396|58.5827608 unknown
InChI: InChI=1S/C11H8O6/c1-3-2-4(12)5-6(7(3)13)9(15)11(17)10(16)8(5)14/h2,14-17H,1H3
charge 0 multiplicity 1
25 atoms
O  -0.574002 2.851123 0.000171
O  -1.573046 -2.648104 0.000026
O  -3.191812 1.901132 -0.000251
O  -3.686985 -0.816321 -0.000319
O  1.905223 2.362951 -0.000309
O  0.898992 -3.066454 -0.000014
C  0.300891 0.578152 -0.000005
C  0.053699 -0.826058 -0.000009
C  1.665808 1.077458 -0.000056
C  -0.78865 1.507904 -0.000034
C  -1.27685 -1.309369 -0.000078
C  2.78967 0.100102 0.000165
C  1.149016 -1.778724 -0.000009
C  -2.138968 1.004705 -0.000198
C  -2.360665 -0.384668 -0.000223
C  2.516264 -1.255217 0.000177
C  4.188746 0.658766 0.000258
H  3.325182 -1.993879 0.00024
H  4.945558 -0.1420 0.000316
H  4.346945 1.307787 0.881051
H  4.347069 1.307784 -0.880514
H  0.472527 2.979711 0.000652
H  -0.623629 -3.140511 0.000407
H  -4.052398 1.402269 -0.000336
H  -3.715884 -1.809638 -0.000308
