program: Gaussian 09
title: 000038934
version: EM64L-G09RevD.01
frameworkgroup: C1[X(C7H12O3)]
method: RPBEPBE
basis: SDD
operation: Freq
keyword: #pfreq=noraman
keyword: PBEPBE/SDD
title: #p freq=noraman PBEPBE/SDD
converged: YES YES NO NO
title: Mulliken charges:
elementType: O O O C C C C C C C H H H H H H H H H H H H
charge: -0.216837 -0.413527 -0.242689 -0.174779 -0.531922 0.235464 -0.689088 -0.686771 -0.480089 0.187183 0.218416 0.275022 0.245691 0.257200 0.290670 0.220135 0.240368 0.210548 0.234669 0.227779 0.215003 0.377554
chargesum: 0.00000
title: Mulliken charges with hydrogens summed into heavy atoms:
elementType: O O O C C C C C C C
charge: -0.216837 -0.035973 -0.242689 0.043637 -0.011209 0.235464 -0.018038 -0.009320 0.067781 0.187183
polarizability: 1.05823548e+02 -1.03100200e+00 7.66846516e+01 3.42635845e-01 2.91796502e+00 7.01852387e+01
1716.lowfreq: -23.4407 -10.2497 -2.2503 -0.0009 -0.0005 0.0004 18.2504 35.8681 50.9961
frequency: 13.0004 35.5205 50.8521 81.9930 131.7093 190.6050 214.9450 231.6274 246.1260 273.1781 308.2215 393.9685 472.5088 516.3519 555.5774 588.4442 634.3269 649.1194 775.3028 797.8330 878.2719 902.8021 922.7308 960.0655 997.6990 1021.6274 1065.3230 1084.1455 1103.1923 1115.4748 1157.3500 1177.7741 1232.7082 1251.5978 1282.7846 1312.3587 1345.8113 1373.1330 1376.5341 1394.9116 1437.3117 1446.2942 1464.3169 1469.2781 1479.4082 1489.7471 1627.8324 1662.3989 2970.6567 2980.5004 2984.8512 2989.3007 2989.6985 3030.0883 3072.9331 3076.6401 3083.5685 3088.0542 3097.5820 3513.3058
redmass: 3.4649 7.9473 3.9497 3.0920 2.6943 1.0777 2.2073 1.7617 2.4746 2.7018 3.7780 2.7899 2.6847 2.1298 2.4853 3.2712 3.1026 1.4799 3.0223 2.0485 2.8697 3.2383 1.1721 1.3750 2.2276 3.7917 2.1441 1.7700 1.9810 2.2913 1.2890 1.8722 1.2669 1.4008 1.3636 1.5158 1.7521 1.9878 1.2144 1.2056 1.0853 1.0927 1.0453 1.0490 1.0501 1.0592 7.8854 8.0639 1.0646 1.0354 1.0661 1.0666 1.0503 1.0938 1.0938 1.1000 1.0999 1.1012 1.0998 1.0639
irintensity: 0.0809 3.4158 1.7964 1.8278 4.4471 0.2799 0.6648 5.1712 0.5202 1.4045 6.8918 14.3064 11.2935 56.0546 22.9403 18.2603 0.8170 122.3139 9.8027 7.7821 8.8956 0.8133 5.3126 3.4501 26.7692 22.0485 296.6088 23.9628 16.5955 4.8634 0.0237 1.6104 72.4914 10.7352 3.1287 51.5187 52.3186 24.5239 15.5626 26.2705 5.7435 61.2989 7.4249 2.6180 19.4371 22.5978 96.6587 193.2056 19.6040 27.9386 31.4179 31.0793 17.2200 8.8815 6.8019 31.0843 39.0809 13.5888 34.1485 23.6341
temp: 298.150 k
press: 1.00000 atm
elementType: 8 8 8 6 6 6 6 6 6 6 1 1 1 1 1 1 1 1 1 1 1 1
symmnumber: 1
zpe: 472951.2 jmol-1
zpe.correction: 0.180138 hartree
zpe.thermalcorrener: 0.192120 hartree
zpe.thermalcorrenthalpy: 0.193064 hartree
zpe.thermalcorrgfe: 0.139641 hartree
zpe.sumelectzpe: -498.826002 hartree
zpe.sumelectthermal: -498.814020 hartree
zpe.sumelectthermalent: -498.813076 hartree
zpe.sumelectthermalfe: -498.866499 hartree
dipole: -0.5314 0.2388 2.2572
dipole: 2.3312
quadrupole: -51.9407 -66.6798 -62.2203
quadrupole: -4.9322 -3.2746 -2.8188
quadrupole: 8.3395 -6.3996 -1.9400 -4.9322 -3.2746 -2.8188
hfenergy: -499.0061398 hartree
pointgroup: C01 [X(C7H12O3)]
dipole: -0.1713712 -0.8374017 -0.3325401 debye
dipolederiv: -0.7202717 -0.004751 0.0025452 -0.0075484 -0.8162179 0.0367431 0.0299022 0.095241 -0.2964219 -1.0615871 -0.2636769 0.4697697 -0.2287789 -0.4658688 0.0725835 0.437792 0.0711655 -0.5468037 -0.7323588 0.0681755 -0.1389209 -0.0547535 -0.4742769 0.2826358 0.057918 0.2794863 -0.8151775 -0.2791336 -0.1641621 -0.0304323 -0.163064 -0.0146722 -0.0597028 -0.0938312 -0.1135055 0.0710329 -0.3731227 0.150627 -0.0365936 0.2776894 -0.0784687 0.0925846 -0.1609878 0.1302258 0.060018 1.1986773 0.019337 0.0692648 0.0082604 0.8518149 -0.0757195 0.0052921 -0.1466807 0.0600906 -0.0024283 0.0537633 0.0265211 -0.0201601 0.009326 -0.0137855 0.0253236 -0.0240308 0.0239589 0.0164912 -0.0287692 -0.0050922 -0.028055 0.0520058 -0.038319 0.1036273 0.0393677 0.0142216 -0.3425005 0.0552674 -0.0842989 0.2699897 -0.0251585 0.1265188 -0.1530861 0.0910987 0.0079111 1.6124065 0.0831553 -0.1453338 0.089237 0.4898521 -0.5050798 -0.2194542 -0.4886265 1.0697602 0.0102726 0.0744493 -0.0436011 0.0839963 -0.0773028 0.0792557 -0.0245904 0.0858336 -0.0210359 0.1514794 0.0195425 0.0140708 -0.0515012 0.103562 0.011374 0.0845394 0.02109 -0.02119 0.0505082 -0.0414716 -0.0144554 -0.0901577 -0.0626407 -0.0644271 0.0377178 -0.0968337 0.0626073 0.0482576 -0.0055481 0.0183961 -0.0464423 0.116097 -0.0278037 0.034531 -0.0040892 -0.066589 0.2038961 0.0190375 -0.0152327 -0.119824 0.0129351 -0.0367377 -0.0092663 -0.0385986 0.1049028 0.0683029 -0.0045813 -0.0737479 0.012231 0.0723337 -0.0710387 -0.0233498 -0.0711199 -0.141113 0.1058867 0.0223469 -0.0009235 0.0803196 -0.0357034 0.0639447 -0.0402909 0.1042247 0.0331699 -0.1305952 -0.0971753 0.0353649 -0.1280205 0.0086584 0.0038389 0.0127196 -0.0125186 0.0943613 0.0780505 0.0202346 -0.0459333 0.0634666 -0.0489287 0.1175521 -0.042541 0.0506096 0.0115449 -0.0927146 -0.1408328 -0.0146282 -0.1264483 0.0104085 -0.0022914 -0.009549 -0.0011007 0.064019 -0.0379193 0.1201548 0.1063786 0.1010639 0.0265947 -0.0780081 0.0820739 -0.0570917 0.0012493 0.2284027 0.0448771 -0.0931172 0.0785001 0.3456505 0.085882 -0.1344902 0.0858531 0.2294833 unknown
polarizability: 105.7946656|1.4196448|74.0328678|-0.148846|-4.3373174|72.8659051 unknown
InChI: InChI=1S/C7H12O3/c1-5(2)6(8)3-4-7(9)10/h5,9H,3-4H2,1-2H3
charge 0 multiplicity 1
22 atoms
O  -1.168314 1.562351 -0.1467
O  3.812173 0.44678 -0.512177
O  2.888616 -0.589634 1.346765
C  -2.375853 -0.529614 0.247585
C  0.229712 -0.412234 0.174087
C  -1.109157 0.322206 0.073916
C  -3.501031 0.256702 0.953315
C  -2.82593 -1.010334 -1.165569
C  1.410079 0.404942 -0.373089
C  2.726216 0.015389 0.262651
H  -2.109867 -1.426165 0.843419
H  0.405371 -0.636269 1.24811
H  0.149764 -1.400741 -0.317325
H  1.499444 0.328312 -1.470174
H  1.224756 1.478867 -0.164828
H  -3.213638 0.535716 1.982971
H  -3.718825 1.187683 0.402163
H  -4.422713 -0.350722 1.003887
H  -3.103592 -0.143622 -1.791577
H  -3.70766 -1.669222 -1.073065
H  -2.031315 -1.575727 -1.686849
H  4.660062 0.211737 -0.045514
