program: Gaussian 09
title: 000038910
version: EM64L-G09RevD.01
frameworkgroup: C1[X(C4H5Cl3)]
method: RPBEPBE
basis: SDD
operation: Freq
keyword: #pfreq=noraman
keyword: PBEPBE/SDD
title: #p freq=noraman PBEPBE/SDD
converged: YES YES NO NO
title: Mulliken charges:
elementType: Cl Cl Cl C C C C H H H H H
charge: 0.017078 0.025556 -0.056661 -0.007069 -0.065891 -0.661680 -0.655331 0.279004 0.250473 0.326216 0.269171 0.279134
chargesum: 0.00000
title: Mulliken charges with hydrogens summed into heavy atoms:
elementType: Cl Cl Cl C C C C
charge: 0.017078 0.025556 -0.056661 0.271936 0.184582 -0.335464 -0.107026
polarizability: 1.12439234e+02 -3.68957206e+00 7.02584584e+01 -7.47235008e+00 1.20068115e-01 4.54935618e+01
1716.lowfreq: -0.7262 -0.0033 -0.0023 0.0025 7.1509 9.6359 39.3088 75.5012 112.2887
frequency: 39.2171 75.4839 112.2756 180.1076 215.9238 279.3381 344.3815 408.3494 438.4973 603.1047 648.5766 692.8313 858.4014 912.0609 984.7076 1080.6404 1117.8572 1158.2478 1190.3484 1206.7930 1247.9287 1292.2698 1322.5587 1453.7048 1663.2872 3061.4431 3119.5394 3135.4566 3145.7560 3150.1769
redmass: 8.5504 7.9714 6.6650 3.0822 7.3422 3.8019 5.6156 7.1398 3.1806 5.7373 7.0244 5.5493 1.6164 1.7912 1.1138 1.6551 2.6950 1.7231 1.0683 1.2499 1.1454 1.2617 1.2934 1.1189 6.1977 1.0571 1.0940 1.0917 1.0954 1.1033
irintensity: 2.8195 3.9321 0.1611 4.5155 2.0190 3.6697 5.1159 42.3994 1.9059 37.5634 168.8435 25.7384 5.4071 3.8078 64.9442 2.6515 65.0043 8.9625 8.3502 10.4754 10.1832 0.3088 38.6092 10.3490 3.9058 14.5760 3.0997 1.6494 1.1608 14.2055
temp: 298.150 k
press: 1.00000 atm
elementType: 17 17 17 6 6 6 6 1 1 1 1 1
symmnumber: 1
zpe: 210179.5 jmol-1
zpe.correction: 0.080053 hartree
zpe.thermalcorrener: 0.088466 hartree
zpe.thermalcorrenthalpy: 0.089410 hartree
zpe.thermalcorrgfe: 0.044253 hartree
zpe.sumelectzpe: -1535.034195 hartree
zpe.sumelectthermal: -1535.025782 hartree
zpe.sumelectthermalent: -1535.024838 hartree
zpe.sumelectthermalfe: -1535.069995 hartree
dipole: -0.8153 -1.9845 0.4125
dipole: 2.1847
quadrupole: -74.7285 -63.8136 -58.1397
quadrupole: 4.7269 1.7549 0.3934
quadrupole: -9.1679 1.7470 7.4209 4.7269 1.7549 0.3934
hfenergy: -1535.1142481 hartree
pointgroup: C01 [X(C4H5Cl3)]
dipole: -0.357591 0.762028 -0.1738375 debye
dipolederiv: -0.6218997 -0.2948071 -0.0202686 -0.2982672 -0.5214908 -0.017105 -0.0536911 -0.0939174 -0.1403339 -0.4327692 0.2190449 -0.0250498 0.2739954 -0.6702019 0.0540838 -0.0300553 0.1355983 -0.1439879 -0.6683729 -0.1056181 -0.0170853 -0.3610358 -0.2968927 -0.0246885 -0.0109442 -0.0448777 -0.1815354 -0.2924699 -0.0529609 0.0299142 -0.0451988 -0.2828027 -0.004652 0.0788981 0.0228787 0.0506851 -0.062826 -0.0334648 -0.0068481 0.0346576 -0.2664612 0.0004781 0.0854742 -0.0740835 0.1203652 1.2323155 0.084898 0.0893527 0.0470087 1.3330071 -0.0475745 -0.0797228 -0.0343977 0.2655955 0.7547641 0.216567 0.0825784 0.3659573 0.458211 0.0453168 -0.0874367 0.0740481 0.1644222 0.0679667 0.0230858 0.0140324 0.006906 0.1576772 -0.0068106 0.0424963 -0.0035228 -0.0300184 0.0666413 0.0137668 0.0356509 0.0453143 0.1439947 -0.017788 0.0528743 -0.0028265 -0.0717831 -0.0090329 -0.0092932 -0.0774601 -0.0067761 -0.0359532 0.0156147 -0.0011787 0.0017012 -0.0404583 0.0290744 -0.0679968 -0.0709014 -0.0477042 0.0471237 -0.0216895 0.016076 -0.0371344 -0.0798923 -0.0633914 0.0067785 -0.0339153 -0.0148571 -0.0662111 0.0248149 -0.0127901 0.0565339 0.0869413 unknown
polarizability: 111.7904924|5.8542933|70.7414605|8.1377551|0.3093545|45.6593014 unknown
InChI: InChI=1S/C4H5Cl3/c5-3-1-2-4(6)7/h1-2,4H,3H2
charge 0 multiplicity 1
12 atoms
Cl 2.758106 1.262906 0.067841
Cl 2.211389 -1.74883 0.162024
Cl -3.483367 -0.720032 -0.071067
C  0.218765 0.170986 0.319236
C  -0.936745 0.392114 -0.365046
C  1.513407 -0.084364 -0.366063
C  -2.239319 0.681878 0.305417
H  0.241744 0.177971 1.415719
H  -0.944172 0.368995 -1.463155
H  1.460348 -0.10703 -1.460991
H  -2.163898 0.723926 1.401074
H  -2.734159 1.580981 -0.09089
