program: Gaussian 09
title: 000038976
version: EM64L-G09RevD.01
frameworkgroup: C1[X(C18H19FN2)]
method: RPBEPBE
basis: SDD
operation: Freq
keyword: #p
keyword: freq=noraman
keyword: PBEPBE/SDD
title: #p freq=noraman PBEPBE/SDD
converged: YES YES NO NO
title: Mulliken charges:
elementType: F N N C C C C C C C C C C C C C C C C C C H H H H H H H H H H H H H H H H H H H
charge: -0.215824 -0.077823 -0.228253 -0.360123 -0.365183 -0.443003 -0.450048 -0.375783 -0.457064 0.219657 0.227165 0.212711 0.182787 -0.321285 -0.363331 -0.553628 -0.388440 -0.383548 -0.227225 0.327949 -0.253837 0.230644 0.180739 0.185353 0.218496 0.230605 0.208597 0.218105 0.226558 0.199982 0.240789 0.237812 0.236556 0.240594 0.242792 0.262266 0.235978 0.250565 0.223130 0.224570
chargesum: 0.00000
title: Mulliken charges with hydrogens summed into heavy atoms:
elementType: F N N C C C C C C C C C C C C C C C C C C
charge: -0.215824 -0.077823 -0.228253 0.051261 0.038665 -0.003802 -0.005386 0.064988 0.017304 0.219657 0.227165 0.212711 0.182787 -0.080691 -0.120539 -0.291362 -0.152462 -0.132983 -0.004096 0.327949 -0.029267
polarizability: 2.44234982e+02 -3.77140373e+00 2.76121245e+02 1.82139923e+01 5.22841990e+00 1.15946809e+02
1716.lowfreq: -9.7064 -2.6762 -0.0005 -0.0005 0.0000 4.5569 14.3862 24.2800 37.1215
frequency: 11.6939 23.7884 37.0875 40.5104 81.3987 98.8354 118.2845 124.7511 158.2772 197.9784 221.2747 253.6146 268.9178 305.6707 331.3750 356.6233 370.4382 393.4537 410.8324 425.8695 448.7784 506.5874 555.4202 565.7894 579.3793 598.3992 616.2742 625.3510 643.4758 707.0689 724.4414 729.2222 752.6066 767.6045 774.2460 784.1994 792.6152 839.9645 854.5453 857.8953 865.9626 870.6591 872.4495 902.5277 918.5467 937.3352 958.2474 966.7435 974.3363 1002.0821 1019.3359 1033.9134 1057.4183 1064.2921 1081.2291 1096.5370 1119.9989 1130.1304 1142.5220 1147.6320 1149.9522 1169.6047 1187.5179 1198.6111 1209.8671 1223.4358 1231.9130 1243.3683 1253.0463 1275.4216 1288.8129 1291.9410 1300.3677 1308.4966 1332.5355 1339.0040 1349.1242 1353.3021 1387.4686 1403.8449 1407.3204 1439.4920 1457.7861 1465.5392 1467.6341 1479.0495 1479.3287 1480.0222 1487.7586 1492.7873 1498.0567 1583.1255 1592.0461 1612.9435 1640.0236 2839.4165 2841.6374 2858.5751 3011.1475 3013.8257 3023.1324 3028.9139 3029.3662 3043.4004 3070.3678 3074.2313 3094.1707 3127.2473 3135.5207 3147.0035 3149.1760 3165.3264 3168.8875 3177.2393
redmass: 2.5424 3.3813 3.8490 2.3369 3.0799 5.2914 3.8556 4.4697 4.9742 4.4095 2.3235 5.7519 2.3749 4.9699 2.2987 5.2025 5.1910 7.1702 4.8942 3.2653 2.8503 6.1994 4.5269 3.7579 4.2546 3.6997 2.9429 5.2049 4.7669 5.1955 4.0681 3.4599 1.7133 2.3871 1.4417 1.3457 1.5703 2.0925 1.4348 3.2788 2.2943 1.5801 4.0066 2.5695 1.3334 1.3904 2.0124 1.5672 1.3078 3.1861 1.9860 4.2483 3.9648 2.4101 2.1249 1.5534 1.6750 1.4683 2.3027 1.9798 2.1247 1.1331 1.3194 1.3420 1.6250 1.8397 2.0108 1.2383 1.5793 1.3952 1.4575 1.3623 1.2865 1.2991 1.5738 1.8257 1.4974 3.0076 1.4088 6.1214 3.5064 3.9758 2.7463 1.0937 1.1362 1.0990 1.0969 3.7512 2.1284 1.5299 1.0978 7.3288 7.4095 7.5769 7.8396 1.0714 1.0717 1.0703 1.0622 1.0598 1.0698 1.0866 1.0825 1.0866 1.1043 1.1041 1.1056 1.0849 1.0894 1.0892 1.0950 1.1001 1.0932 1.0959
irintensity: 0.0275 0.1697 0.2354 0.3872 0.3759 0.2099 0.5201 0.5676 0.3489 1.0773 2.9633 1.7274 0.2631 0.2763 6.9193 3.5271 0.7936 0.3509 9.3548 4.6519 0.0318 4.5169 12.8918 3.6014 1.6399 7.5394 5.1178 3.1385 3.5137 14.2123 4.9801 8.0802 64.2830 11.9362 2.0437 5.5571 59.9419 13.5610 0.9759 22.1319 20.2752 28.3861 9.9890 6.2701 0.0903 2.0564 0.6285 3.3721 0.0112 2.1212 11.0302 5.9540 9.1110 2.6135 15.6968 0.2596 20.3459 20.4731 14.0162 96.2754 21.4550 6.8544 4.8516 8.2722 16.1571 4.8424 4.6046 3.0402 11.8550 12.0264 22.3084 2.0676 5.8426 12.1651 6.1765 39.9690 4.1436 16.9610 1.7445 2.0248 30.3883 5.1813 91.5742 11.8327 22.9641 2.9246 6.8829 143.5365 8.9213 42.3168 11.4051 3.3416 18.8755 7.6871 23.6178 67.6476 32.0056 173.7945 24.2449 17.5685 53.7837 8.2284 73.1671 29.2441 6.7235 17.0198 67.0955 0.7947 4.8782 8.7546 33.4203 30.3965 2.7875 4.4548
temp: 298.150 k
press: 1.00000 atm
elementType: 9 7 7 6 6 6 6 6 6 6 6 6 6 6 6 6 6 6 6 6 6 1 1 1 1 1 1 1 1 1 1 1 1 1 1 1 1 1 1 1
symmnumber: 1
zpe: 862481.1 jmol-1
zpe.correction: 0.328502 hartree
zpe.thermalcorrener: 0.346457 hartree
zpe.thermalcorrenthalpy: 0.347402 hartree
zpe.thermalcorrgfe: 0.279339 hartree
zpe.sumelectzpe: -905.158921 hartree
zpe.sumelectthermal: -905.140965 hartree
zpe.sumelectthermalent: -905.140021 hartree
zpe.sumelectthermalfe: -905.208084 hartree
dipole: -4.3459 0.8550 -0.0538
dipole: 4.4295
quadrupole: -121.9283 -121.1030 -127.0675
quadrupole: 13.4196 0.0744 2.9524
quadrupole: 1.4380 2.2633 -3.7012 13.4196 0.0744 2.9524
hfenergy: -905.487423 hartree
pointgroup: C01 [X(C18H19F1N2)]
dipole: -1.6969613 -0.3964963 0.0110425 debye
polarizability: 243.886028|3.4172987|275.7235684|-18.6936554|10.9646837|116.6934397 unknown
InChI: InChI=1S/C18H19FN2/c19-14-7-8-18-16(13-14)15-5-1-2-6-17(15)21(18)12-11-20-9-3-4-10-20/h1-2,5-8,13H,3-4,9-12H2
charge 0 multiplicity 1
40 atoms
F  4.149077 3.561099 -0.333967
N  -3.577911 -0.141316 -0.049109
N  0.176148 -0.259648 0.506709
C  -4.506193 -0.388703 -1.184662
C  -4.083147 1.094249 0.614324
C  -5.89213 -0.131186 -0.556019
C  -5.633563 1.018308 0.472835
C  -2.152605 -0.118427 -0.415798
C  -1.248872 -0.184293 0.841048
C  1.041769 0.837486 0.328302
C  0.891907 -1.4431 0.241939
C  2.345463 0.347253 -0.039096
C  2.249592 -1.104672 -0.094581
C  0.779325 2.217985 0.468056
C  0.448886 -2.78366 0.28042
C  3.402307 1.260184 -0.264639
C  3.172149 -2.134214 -0.393084
C  1.838781 3.122849 0.243953
C  1.389143 -3.792429 -0.020442
C  3.11208 2.622781 -0.11369
C  2.736616 -3.475276 -0.354175
H  -4.384253 -1.417173 -1.568565
H  -4.326061 0.320952 -2.032811
H  -3.69263 2.011296 0.10196
H  -3.758663 1.135347 1.669349
H  -6.237277 -1.03999 -0.033931
H  -6.648634 0.138581 -1.312911
H  -6.03604 1.981617 0.114051
H  -6.117587 0.797262 1.438932
H  -1.882459 0.791025 -1.013665
H  -1.93844 -0.99989 -1.048554
H  -1.534353 -1.068878 1.437638
H  -1.413317 0.701946 1.479635
H  -0.212446 2.592601 0.73885
H  -0.584836 -3.042251 0.532495
H  4.408628 0.936608 -0.544897
H  4.210199 -1.896182 -0.65084
H  1.694167 4.202953 0.337831
H  1.074243 -4.841835 0.002086
H  3.438537 -4.28416 -0.583176
