program: Gaussian 16
title: DA P
version: ES64L-G16RevC.01
method: RB3LYP
basis: def2SVP
operation: Freq
keyword: #N
keyword: Geom=AllCheck
keyword: Guess=TCheck
keyword: SCRF=Check
keyword: GenChk
keyword: RB3LYP/def2SVPFreq
converged: YES YES YES YES
title: Mulliken charges:
elementType: C C C C C C H H H H C H C O C H H C C C C H C H C H H H O C H H C C C C H H N O O C C C C H C H C H H H
charge: 0.027071 -0.068802 -0.078760 0.000545 -0.043896 0.010830 0.004342 0.002449 -0.010598 0.003878 0.291041 0.017878 0.220271 -0.359779 0.203181 0.021647 0.036151 -0.000304 -0.036645 -0.017867 -0.004228 -0.004000 0.000949 -0.014717 0.002043 0.002118 -0.000685 0.002349 -0.377085 0.190330 0.029818 0.032977 0.210177 -0.132829 0.068800 0.193894 0.057918 0.011606 -0.236476 -0.216984 -0.209610 0.140419 0.001072 0.001993 -0.013438 -0.000708 -0.012829 0.004249 0.019543 0.010471 0.010778 0.009453
chargesum: -0.00000
title: Mulliken charges with hydrogens summed into heavy atoms:
elementType: C C C C C C C C O C C C C C C C O C C C C C N O O C C C C C C
charge: 0.031413 -0.066353 -0.078760 0.000545 -0.054494 0.014708 0.308920 0.220271 -0.359779 0.260979 -0.000304 -0.040645 -0.032584 -0.002110 0.000264 0.004392 -0.377085 0.253124 0.210177 -0.074911 0.080405 0.193894 -0.236476 -0.216984 -0.209610 0.140419 0.000364 0.006241 -0.002967 -0.002051 0.028996
1716.lowfreq: -5.0270 -0.0007 -0.0005 0.0006 3.2262 6.9915 23.6106 26.9102 37.6379
frequency: 23.3450 26.8962 37.5886 48.0453 60.3323 67.5297 73.3656 85.1956 106.4979 117.5821 132.6566 151.0404 160.0117 183.6297 224.8841 237.8264 246.8494 270.0988 278.0440 299.0115 318.4243 336.2157 360.9170 407.3886 422.6335 423.2373 450.0810 460.9081 483.3345 488.7169 521.1712 529.1144 553.8704 576.0926 611.9487 627.7156 629.5820 634.4892 641.0320 657.8430 679.9188 716.0760 723.6412 727.0193 730.7258 739.0586 766.6402 776.3161 778.7645 788.5776 800.8146 811.7936 817.3999 855.3963 857.9685 861.8319 868.2799 901.2187 913.9346 928.8124 945.5574 955.3855 958.4186 986.3786 999.4449 1004.5520 1009.2097 1013.4655 1015.1672 1016.9785 1021.6141 1032.3352 1032.8053 1033.2041 1040.8358 1050.7486 1056.2782 1061.3789 1065.8252 1084.7924 1090.0206 1095.3172 1105.2042 1112.2802 1146.1477 1153.4281 1168.0545 1168.1936 1169.8894 1185.7024 1193.5094 1197.3599 1203.1649 1209.3938 1219.5027 1226.4395 1231.2839 1234.1899 1252.8665 1279.3800 1284.9175 1297.6698 1329.9697 1336.7281 1343.9606 1354.0072 1358.5546 1365.1595 1365.7255 1366.2017 1370.4364 1399.6781 1409.7918 1475.7558 1483.1098 1485.5673 1490.9811 1498.2004 1514.3131 1528.4614 1529.5706 1633.3221 1637.4715 1644.3818 1657.3373 1660.4755 1664.8824 1797.0138 1865.4156 3036.6003 3050.6432 3052.2330 3070.2500 3100.1032 3121.1438 3125.9715 3167.0065 3174.4744 3177.0403 3179.1045 3183.3891 3188.8104 3191.0690 3194.6678 3198.6182 3203.9343 3212.7880 3214.1924 3216.4125 3236.6110
redmass: 5.0289 5.6774 3.8535 4.8275 4.6610 6.1352 2.1290 4.9246 4.4408 5.1778 3.4299 7.2099 5.2708 7.1490 5.1101 6.9556 5.9415 5.8779 5.8764 7.0445 6.0779 5.7000 8.3908 6.3837 2.8356 2.8316 4.1587 6.0481 6.3108 3.9948 3.7250 5.4132 4.4336 4.0881 5.5995 5.9770 6.1614 8.7812 5.1433 5.1339 5.4846 1.7011 1.6767 6.0727 3.8409 4.8870 2.2072 1.9382 2.3737 2.8320 3.4168 5.4873 3.4566 1.2967 1.4157 2.5644 1.2711 1.9398 3.9935 2.5518 1.5234 1.6663 2.8872 1.6445 4.1275 1.3901 1.4788 4.8058 5.9598 3.6469 4.5197 1.4162 1.3460 1.3612 3.3585 2.0979 2.2568 3.5364 2.6940 2.1774 2.8829 3.6307 1.5897 1.5934 1.9465 1.7832 1.0749 1.0736 1.0949 1.1513 2.0701 1.9984 1.2098 2.4521 1.1491 1.1317 1.9549 3.4035 1.9957 1.9417 1.4866 1.4822 2.0713 1.4557 1.9679 2.6281 1.5365 2.1558 1.5237 5.3955 2.9387 1.7314 5.2245 2.3396 2.4725 2.4407 1.1179 1.1025 2.8804 2.5735 2.3998 6.4236 6.1025 6.4558 6.0785 5.9992 6.6029 12.8180 12.7749 1.0638 1.0836 1.0636 1.0856 1.1079 1.0893 1.1068 1.0873 1.0897 1.0878 1.0873 1.0948 1.0917 1.0938 1.0995 1.0968 1.0952 1.0964 1.0947 1.0963 1.0924
irintensity: 0.0522 0.9091 0.2383 0.6916 0.1828 0.9229 2.0735 2.9060 1.8833 2.4862 6.5493 3.1214 0.9452 6.1088 0.9276 2.2092 3.8485 0.1377 5.3122 14.7652 4.2661 1.5270 3.6705 2.3900 0.3085 0.5475 2.1763 0.5993 13.2850 10.3071 16.4442 27.0556 7.3016 2.1701 9.6455 0.8996 1.4528 28.6667 1.5317 42.0334 2.3598 39.4675 61.5552 28.7198 4.2301 19.9409 53.6553 28.0784 9.8325 21.5457 38.7247 28.5250 22.5710 0.4127 2.0498 0.9820 3.5069 13.5143 5.4898 26.8716 9.3978 0.8546 36.9914 64.1240 42.5080 0.2151 0.6281 3.4720 2.9895 116.8511 31.8040 5.3237 1.7638 1.8311 75.3089 4.3469 22.4059 47.4701 13.4554 8.7462 36.0069 243.5167 6.6864 42.2800 154.3010 16.8239 0.5118 0.0732 2.0102 7.6998 45.2630 98.8610 0.0975 29.4986 12.1551 6.9303 210.2219 52.3245 7.9955 28.1040 10.4454 3.3374 45.2660 12.7497 11.3136 110.0530 8.4204 1.9330 3.9864 4.9639 7.8638 77.6023 422.9022 11.1624 4.9365 17.6146 8.8436 1.3784 13.1579 138.4324 25.9592 4.3553 0.2238 4.3117 18.0339 14.8258 8.9445 979.2475 23.6040 57.3733 3.2274 72.4885 9.5724 17.7148 14.5254 32.1925 4.6802 2.1660 2.7974 0.0123 27.7922 10.3183 15.8927 20.7175 18.9061 6.7223 1.7559 5.1889 1.0385 2.1681
temp: 298.150 k
press: 1.00000 atm
elementType: 6 6 6 6 6 6 1 1 1 1 6 1 6 8 6 1 1 6 6 6 6 1 6 1 6 1 1 1 8 6 1 1 6 6 6 6 1 1 7 8 8 6 6 6 6 1 6 1 6 1 1 1
symmnumber: 1
zpe: 1091467.8 jmol-1
zpe.correction: 0.415718 hartree
zpe.thermalcorrener: 0.439442 hartree
zpe.thermalcorrenthalpy: 0.440386 hartree
zpe.thermalcorrgfe: 0.360889 hartree
zpe.sumelectzpe: -1357.780615 hartree
zpe.sumelectthermal: -1357.756891 hartree
zpe.sumelectthermalent: -1357.755947 hartree
zpe.sumelectthermalfe: -1357.835444 hartree
dipole: 0.6035 2.2528 -1.7678
dipole: 2.9265
quadrupole: -173.4638 -160.8811 -167.9180
quadrupole: 4.1502 -6.3990 -1.1407
quadrupole: -6.0429 6.5399 -0.4970 4.1502 -6.3990 -1.1407
hfenergy: -1358.1963332 hartree
pointgroup: C01 [X(C26H21N1O4)]
dipole: 0.2085321 0.898525 -0.6890823 debye
polarizability: 405.7948178|-30.9655682|399.2004254|-20.4339266|15.5934157|316.2390864 unknown
InChI: InChI=1S/C26H21NO4/c28-24-22-21(17-9-3-1-4-10-17)19-13-7-8-14-20(19)26(30-15-16-31-26)23(22)25(29)27(24)18-11-5-2-6-12-18/h1-14,21-23H,15-16H2
charge 0 multiplicity 1
52 atoms
C  1.3116023 0.34886412 3.41450845
C  1.83625735 -0.0461125 2.17849826
C  1.40445523 0.56588293 0.99792792
C  0.42148606 1.57506469 1.06932023
C  -0.10254888 1.9674372 2.30389971
C  0.34413964 1.35530899 3.47954424
H  1.65749385 -0.13974555 4.3293091
H  2.5817263 -0.84192816 2.13348998
H  -0.86196515 2.74982557 2.33540796
H  -0.06743702 1.66255177 4.4444099
C  1.85251351 0.16167358 -0.4022322
H  2.25979413 1.07254661 -0.8688737
C  -0.0300238 2.21885461 -0.22770422
O  -1.13179463 3.05258791 -0.01335245
C  -1.11846401 4.04129904 -1.03983149
H  -1.75482862 3.72383779 -1.88241989
H  -1.51475615 4.97714698 -0.62062206
C  2.98058644 -0.85467447 -0.48368506
C  4.2601767 -0.43661637 -0.0689164
C  2.84160203 -2.15746879 -0.98265125
C  5.36002095 -1.29353629 -0.13596708
H  4.39056194 0.57967308 0.31434619
C  3.94533368 -3.01724617 -1.05920371
H  1.86548989 -2.52144532 -1.29830524
C  5.20642234 -2.59322664 -0.63421979
H  6.34174752 -0.94409659 0.19544221
H  3.81122059 -4.02891079 -1.45214286
H  6.06517615 -3.26744348 -0.692008
O  0.99747098 3.07519982 -0.70930899
C  0.37224005 4.1330365 -1.43924183
H  0.51400026 4.00280875 -2.52624776
H  0.84026812 5.08166478 -1.1347075
C  -0.3797294 -1.15119223 -0.54351531
C  0.55490554 -0.12646734 -1.19437677
C  -0.33247835 1.12792162 -1.33617209
C  -1.75121412 0.61245563 -1.212362
H  0.80387278 -0.51747026 -2.19423332
H  -0.22348641 1.6160551 -2.31244548
N  -1.69085646 -0.66718249 -0.64216604
O  -0.08600325 -2.21164642 -0.04237268
O  -2.76960971 1.18076054 -1.52747246
C  -2.84108871 -1.39292321 -0.2119439
C  -3.01986324 -2.72538718 -0.60377067
C  -3.78327147 -0.75932629 0.60874819
C  -4.14713979 -3.42545651 -0.16609619
H  -2.27784643 -3.20835619 -1.24070655
C  -4.91272958 -1.46407213 1.03104726
H  -3.62751439 0.27772877 0.90994502
C  -5.09633725 -2.79757715 0.64785895
H  -4.28512741 -4.46686316 -0.46783691
H  -5.64955239 -0.9691808 1.6688293
H  -5.97878075 -3.3477329 0.98450301
