program: Gaussian 09
title: 000038924
version: EM64L-G09RevD.01
frameworkgroup: C1[X(C16H25N)]
method: RPBEPBE
basis: SDD
operation: Freq
keyword: #pfreq=noraman
keyword: PBEPBE/SDD
title: #p freq=noraman PBEPBE/SDD
converged: YES YES NO NO
title: Mulliken charges:
elementType: N C C C C C C C C C C C C C C C C H H H H H H H H H H H H H H H H H H H H H H H H H
charge: -0.329717 0.319616 0.356744 -0.633659 -0.583172 0.367155 -0.386271 -0.569546 -0.385044 -0.384993 0.520955 -0.641863 -0.467301 -0.425561 -0.735442 -0.747265 -0.651030 0.208792 0.231673 0.211219 0.199257 0.207868 0.199051 0.199016 0.209076 0.184746 0.202666 0.198419 0.209044 0.236236 0.228741 0.235499 0.208307 0.242807 0.204046 0.227193 0.238608 0.198703 0.252738 0.217676 0.195344 0.229670
chargesum: 0.00000
title: Mulliken charges with hydrogens summed into heavy atoms:
elementType: N C C C C C C C C C C C C C C C C
charge: -0.076979 0.319616 0.356744 -0.193195 -0.172696 0.367155 0.020648 -0.161454 0.002368 0.022469 0.520955 -0.405627 -0.238560 -0.190063 -0.080282 -0.082761 -0.008340
polarizability: 2.34723453e+02 -3.50234677e-01 1.70798316e+02 5.27424497e+00 6.06910060e+00 1.30234376e+02
1716.lowfreq: -24.5134 -11.5907 -0.0005 0.0004 0.0006 4.6175 13.8126 40.1664 56.8351
frequency: -8.0683 39.7673 56.3941 77.4160 108.5854 129.5253 176.7362 201.4641 213.1008 221.5739 233.8950 249.9464 260.7071 278.4691 307.3043 322.3060 334.5678 356.5389 376.4200 392.9275 426.5122 440.8214 455.2262 477.3530 503.4542 513.4882 572.1928 596.4804 634.6726 708.1868 715.2638 737.2414 766.3414 795.3505 821.1832 843.5861 859.1495 869.4407 877.5499 888.5355 904.2139 918.4796 941.7922 951.0283 958.3932 963.6787 972.3507 1004.5667 1035.1829 1072.1996 1072.9591 1086.1056 1101.0717 1113.6275 1122.4960 1128.8904 1134.2770 1169.4310 1185.6149 1193.1190 1206.4660 1222.7491 1231.3383 1250.0549 1255.8935 1263.2674 1271.5918 1293.1228 1303.2712 1324.1899 1327.1822 1342.8109 1354.2476 1356.3546 1368.7530 1381.1633 1386.4606 1415.9022 1436.0986 1446.7178 1456.0092 1460.1096 1462.0268 1462.3935 1462.8733 1465.9276 1467.1803 1474.0322 1476.3434 1483.3758 1490.8952 1498.3021 1500.1834 1581.2811 1618.5301 2886.6802 2953.7371 2954.6033 2956.9324 2969.1738 2969.9982 2970.4627 2973.0612 2985.0610 3012.2296 3021.8347 3025.7885 3027.1627 3030.1934 3036.2455 3046.2499 3060.7095 3065.1619 3073.1712 3077.0264 3097.8160 3103.3300 3108.5494 3135.5489 3439.7391
redmass: 3.0930 3.6762 3.1373 1.9544 3.1126 3.0447 2.0530 2.0202 1.7217 1.7850 1.5033 2.2066 1.1589 2.5800 2.4873 2.7475 2.1388 2.1481 2.4303 2.9838 2.2956 2.1599 2.5104 2.7161 2.7337 2.1930 2.9016 1.9499 3.1536 3.8340 4.2882 3.0182 2.4857 2.8060 1.4860 1.3913 1.9797 2.0872 1.8608 1.9009 1.6118 1.3979 2.1051 1.7112 1.9489 1.6218 2.5039 1.3875 2.0191 1.7673 1.5572 1.7906 1.6766 2.0292 2.1349 1.5176 1.4994 1.4099 2.5079 1.2115 1.3762 1.7040 2.1736 1.8956 1.2697 1.6376 2.0003 1.3330 1.5374 1.5220 1.3638 1.3437 1.5399 1.4555 1.2317 4.1504 1.2306 2.9267 1.1488 1.1761 1.0534 1.0901 1.0737 1.0898 1.1053 1.0749 1.1118 1.0614 1.1236 1.0758 1.0780 1.0484 2.6138 6.7588 6.6658 1.0553 1.0610 1.0646 1.0643 1.0363 1.0609 1.0639 1.0383 1.0591 1.0973 1.0747 1.0971 1.1009 1.0951 1.1023 1.1012 1.0981 1.0972 1.0995 1.0988 1.0994 1.0905 1.0869 1.0963 1.0744
irintensity: 0.1560 0.4562 0.1035 1.4065 0.6211 0.0851 0.0866 0.1083 0.9783 0.4518 3.0669 0.0875 0.4406 0.7734 5.6208 1.5205 2.3726 0.5177 4.9917 3.9618 3.5145 3.9162 6.9553 2.6956 18.8041 2.2861 29.2741 73.9941 4.8857 0.4425 4.8332 5.0420 2.1418 0.6006 19.5427 14.4120 2.7266 4.0039 1.4032 2.2814 7.7755 0.8971 0.9555 2.2871 5.3528 3.3756 8.0846 0.9206 0.1008 3.2892 14.9598 2.2880 5.2593 0.8910 18.5611 14.2590 0.3223 6.4141 39.9524 1.2415 3.7692 3.7584 27.9637 2.6043 1.1462 6.7073 4.6836 1.6207 23.9472 2.7083 0.0931 0.4400 3.3109 0.7799 24.9710 1.1528 20.2812 5.1294 4.0645 13.2156 3.5329 12.6081 4.0435 6.9146 2.8842 1.4432 11.3821 2.0948 17.3874 15.4182 13.2196 18.6417 23.4919 2.6334 6.4407 111.2585 39.3786 32.9511 23.4020 26.3628 45.4010 36.2701 35.9360 23.5308 80.2340 53.1177 83.0836 7.7923 7.3569 109.8469 10.0489 17.9341 50.0688 60.2745 35.0479 32.5751 21.6440 14.2832 23.2226 3.3735
temp: 298.150 k
press: 1.00000 atm
elementType: 7 6 6 6 6 6 6 6 6 6 6 6 6 6 6 6 6 1 1 1 1 1 1 1 1 1 1 1 1 1 1 1 1 1 1 1 1 1 1 1 1 1
symmnumber: 1
zpe: 978824.7 jmol-1
zpe.correction: 0.372815 hartree
zpe.thermalcorrener: 0.389593 hartree
zpe.thermalcorrenthalpy: 0.390537 hartree
zpe.thermalcorrgfe: 0.329590 hartree
zpe.sumelectzpe: -678.132174 hartree
zpe.sumelectthermal: -678.115396 hartree
zpe.sumelectthermalent: -678.114452 hartree
zpe.sumelectthermalfe: -678.175399 hartree
dipole: 0.4192 -1.1195 0.8444
dipole: 1.4636
quadrupole: -97.2915 -102.5479 -106.9453
quadrupole: 3.7876 -2.6610 2.3068
quadrupole: 4.9701 -0.2863 -4.6837 3.7876 -2.6610 2.3068
hfenergy: -678.5049887 hartree
pointgroup: C01 [X(C16H25N1)]
dipole: -0.1672928 0.4472602 0.3217802 debye
polarizability: 234.5534654|0.3923231|170.4127984|-6.6471664|-7.320686|130.7898805 unknown
InChI: InChI=1S/C16H25N/c1-16(2,17-3)12-13-9-10-14-7-5-4-6-8-15(14)11-13/h9-11,17H,4-8,12H2,1-3H3
charge 0 multiplicity 1
42 atoms
N  4.593676 0.174508 0.1184
C  3.142913 0.11154 0.48856
C  -1.474354 0.34531 -0.65268
C  2.3493 -0.297594 -0.805455
C  -2.410959 1.533117 -0.8327
C  -1.975008 -0.951396 -0.328862
C  -3.200404 1.93191 0.448057
C  -3.465142 -1.211577 -0.151105
C  -4.429259 1.040644 0.748092
C  -4.120487 -0.447891 1.036313
C  0.855287 -0.529627 -0.635537
C  -0.078231 0.525842 -0.803946
C  -1.049472 -2.012337 -0.17472
C  0.340403 -1.813015 -0.324479
C  2.605949 1.452497 1.068747
C  3.025952 -0.993129 1.565137
C  5.053527 1.229162 -0.80533
H  2.503075 0.495113 -1.563398
H  2.839572 -1.21171 -1.189536
H  -1.817444 2.403806 -1.170254
H  -3.145252 1.32329 -1.639439
H  -2.510515 1.927882 1.315367
H  -3.554284 2.97573 0.328489
H  -4.014213 -0.942933 -1.078875
H  -3.617363 -2.297609 -0.003386
H  -5.125522 1.096478 -0.115799
H  -4.974669 1.466063 1.614719
H  -5.073366 -0.953638 1.29215
H  -3.466703 -0.532851 1.927066
H  0.296545 1.524126 -1.067459
H  -1.427395 -3.015339 0.060549
H  1.028882 -2.658879 -0.209131
H  2.684268 2.2749 0.33331
H  1.544265 1.360411 1.357592
H  3.184394 1.739379 1.967959
H  3.416216 -1.95053 1.175822
H  1.97768 -1.134886 1.876303
H  3.613666 -0.720428 2.464221
H  5.175888 0.136853 0.966017
H  6.147604 1.135443 -0.929649
H  4.837697 2.275373 -0.481388
H  4.604182 1.088994 -1.80454
