program: Gaussian 09
title: 000039027
version: EM64L-G09RevD.01
frameworkgroup: C1[X(C20H26N2O3)]
method: RPBEPBE
basis: SDD
operation: Freq
keyword: #p
keyword: freq=noraman
keyword: PBEPBE/SDD
title: #p freq=noraman PBEPBE/SDD
converged: YES YES NO NO
title: Mulliken charges:
elementType: O O O N N C C C C C C C C C C C C C C C C C C C C H H H H H H H H H H H H H H H H H H H H H H H H H H
charge: -0.284985 -0.302464 -0.305783 -0.246011 -0.078457 0.088640 0.244218 0.207973 0.210571 -0.461865 0.215466 -0.367049 -0.525706 -0.440022 -0.544314 0.197542 -0.390012 0.216309 0.203513 -0.847243 -0.615398 -0.616889 -0.536214 -0.530177 -0.528589 0.271625 0.234299 0.213815 0.226658 0.258717 0.233987 0.255198 0.235720 0.230237 0.233291 0.282699 0.228539 0.191355 0.223407 0.224802 0.191440 0.226642 0.219823 0.240890 0.220045 0.217082 0.258274 0.224755 0.219397 0.249336 0.224912
chargesum: 0.00000
title: Mulliken charges with hydrogens summed into heavy atoms:
elementType: O O O N N C C C C C C C C C C C C C C C C C C C C
charge: -0.284985 -0.302464 -0.305783 -0.246011 -0.078457 0.088640 0.244218 0.207973 0.210571 0.044058 0.215466 0.073424 -0.266989 -0.206035 -0.289116 0.197542 -0.154292 0.216309 0.203513 -0.101015 0.027903 0.025995 0.144544 0.169935 0.165056
polarizability: 3.89533245e+02 -2.07001586e+01 2.70657595e+02 -4.10563167e-01 -1.47270977e+01 1.44067729e+02
1716.lowfreq: -8.4556 -6.8527 -0.0007 -0.0005 0.0002 1.9718 16.4196 26.2974 31.8025
frequency: 16.0261 26.2258 31.5822 40.6674 60.7345 71.2463 91.8064 101.7038 107.3330 112.3419 125.2688 149.2699 165.8714 172.7549 181.4034 198.2525 203.6996 210.5413 220.0985 238.1045 249.1107 253.3085 264.2288 268.2262 273.8594 303.9988 330.7083 333.0286 345.7430 352.2325 383.0952 395.9105 418.4872 434.5487 456.9644 473.1612 485.6343 505.7419 515.7631 560.5290 602.6286 630.2938 632.7453 661.2954 673.8845 700.3190 714.6340 733.6746 740.0420 767.7068 795.1135 797.0517 822.7764 843.4030 854.5437 890.2470 896.5440 919.0371 925.4853 956.3706 991.1926 1010.8628 1021.7025 1033.3541 1035.7775 1055.1756 1065.6898 1091.4175 1099.5044 1107.4644 1111.5502 1113.0127 1113.7148 1115.8442 1138.9211 1145.8830 1151.8905 1156.0112 1164.6000 1187.9372 1205.6833 1216.8274 1228.5079 1232.0971 1258.2731 1268.2941 1287.8171 1310.8755 1328.7578 1357.7574 1371.5630 1377.5602 1381.8790 1397.0761 1408.2849 1420.7338 1423.4895 1427.0522 1438.3628 1443.3940 1455.6394 1457.1415 1462.7523 1463.6146 1465.6646 1466.6091 1466.6315 1473.4763 1476.5052 1478.0933 1479.4475 1480.8956 1485.7471 1487.2596 1495.5654 1499.4494 1504.9172 1570.8188 1587.3253 1613.5812 1638.3842 2852.7757 2854.9076 2872.0827 2956.7087 2965.4583 2968.3613 2979.9352 3015.6593 3020.9216 3030.4940 3033.4914 3043.7694 3058.8949 3061.4752 3066.8402 3079.0419 3085.1570 3113.9156 3114.0240 3116.9781 3117.3244 3120.2980 3138.7596 3155.0988 3159.3621 3173.1267
redmass: 3.8396 3.6961 2.7278 3.8038 3.3568 3.4018 3.7621 2.8098 3.9600 2.4877 2.9447 2.1927 1.1187 1.3010 2.8838 2.8148 1.1633 1.3007 2.5960 2.2711 1.6479 1.2726 4.1509 4.6523 3.4908 2.6479 3.2196 3.4840 4.5621 3.1384 4.2176 3.4210 3.1343 3.0183 3.8234 4.7960 4.0990 5.8468 3.8615 5.6241 4.3758 4.1790 4.7316 4.3860 5.3765 7.0269 6.3906 3.1728 3.8689 4.3626 1.6601 1.3202 4.5462 4.0496 1.6753 1.5847 3.3408 5.3161 1.3655 4.6097 2.5774 4.5489 3.4565 1.5829 1.4751 2.2876 2.1219 1.3068 2.1856 2.7750 1.2775 1.3324 1.2537 2.1412 1.5009 1.5282 1.4241 1.5439 1.7694 1.7433 2.9131 1.4032 2.0808 2.9843 2.8323 2.6032 1.6925 1.8025 1.4492 3.5959 2.9325 1.7030 3.4828 1.2433 2.4859 1.1827 1.4743 1.3653 1.2664 1.1631 1.1080 1.1182 1.2903 1.5245 1.3465 1.2883 1.1492 1.3608 1.0602 1.0807 1.1091 1.2846 1.0597 1.0549 1.1031 2.3226 1.2112 9.5880 8.2647 7.8363 7.9956 1.0569 1.0662 1.0602 1.0327 1.0309 1.0315 1.0421 1.0737 1.0734 1.0724 1.0825 1.1038 1.0943 1.1035 1.1026 1.1011 1.1004 1.1022 1.0963 1.1030 1.0993 1.0940 1.0889 1.0920 1.0921 1.0940
irintensity: 0.0689 0.6039 0.2638 2.2949 0.2924 0.9960 6.4008 7.9700 1.3507 0.9698 3.0890 2.0332 0.2365 0.4710 1.2971 7.8625 0.5785 0.3187 3.8833 2.2634 4.5852 1.2741 1.5677 1.7821 5.7483 0.1251 1.2655 8.4560 0.4030 4.7122 5.9679 2.6060 2.5484 0.9978 3.3219 5.1637 3.4293 14.6128 0.3140 8.2387 17.7975 6.6360 5.4326 13.4163 6.1925 0.9201 17.0359 0.8540 6.5645 8.8879 41.1466 11.1459 18.5021 5.3954 21.8788 16.9894 5.5812 32.2676 0.4225 121.4417 21.6204 10.8406 44.7810 19.2224 1.7991 13.1404 125.1561 5.7361 26.8424 103.4367 0.5807 21.6174 6.8600 108.4318 35.6168 28.7968 0.2842 7.5504 63.6964 30.1130 143.2984 16.4719 20.1777 103.2856 26.8042 12.3617 7.2866 13.6648 13.4472 10.9901 63.0315 37.3854 104.4512 8.8074 8.0124 11.0881 15.2682 23.6992 13.5423 0.9731 35.3443 27.5152 21.9828 16.9623 78.0259 95.6043 61.7442 36.3414 23.6417 1.3738 20.9789 14.6920 14.9434 23.0255 19.1778 26.3600 12.7262 4.9408 17.7606 123.4338 18.0806 62.5784 71.9888 179.4333 105.0327 94.8875 84.8213 32.8592 4.7983 38.2391 49.4857 41.5974 48.6655 21.5537 29.1357 27.3088 26.3575 56.0107 39.1752 6.4119 32.6194 24.4606 5.6751 5.9587 8.3346 3.6462 18.2349
temp: 298.150 k
press: 1.00000 atm
elementType: 8 8 8 7 7 6 6 6 6 6 6 6 6 6 6 6 6 6 6 6 6 6 6 6 6 1 1 1 1 1 1 1 1 1 1 1 1 1 1 1 1 1 1 1 1 1 1 1 1 1 1
symmnumber: 1
zpe: 1106827.9 jmol-1
zpe.correction: 0.421568 hartree
zpe.thermalcorrener: 0.447742 hartree
zpe.thermalcorrenthalpy: 0.448686 hartree
zpe.thermalcorrgfe: 0.364294 hartree
zpe.sumelectzpe: -1110.978487 hartree
zpe.sumelectthermal: -1110.952314 hartree
zpe.sumelectthermalent: -1110.951370 hartree
zpe.sumelectthermalfe: -1111.035762 hartree
dipole: 0.8378 0.8306 0.6061
dipole: 1.3263
quadrupole: -133.0035 -129.2848 -151.8923
quadrupole: -9.3008 3.1440 3.0941
quadrupole: 5.0567 8.7754 -13.8321 -9.3008 3.1440 3.0941
hfenergy: -1111.400056 hartree
pointgroup: C01 [X(C20H26N2O3)]
dipole: 0.3403215 0.3163161 0.2375245 debye
polarizability: 388.6702675|-22.8038047|271.9135895|-6.8421546|-11.4158011|143.6747115 unknown
InChI: InChI=1S/C20H26N2O3/c1-13-17(23-4)8-7-14-15-11-18(24-5)19(25-6)12-16(15)22(20(13)14)10-9-21(2)3/h7-8,11-12H,9-10H2,1-6H3
charge 0 multiplicity 1
51 atoms
O  4.87744 -1.626154 -0.301197
O  -4.469656 0.784382 -0.269961
O  -4.353727 -2.040654 0.390512
N  0.481608 0.65903 -0.591673
N  1.220067 4.346914 0.026187
C  1.414354 -0.390671 -0.374387
C  -0.819981 0.163052 -0.362355
C  0.668646 -1.576423 -0.021767
C  -0.741947 -1.226173 -0.018843
C  0.735074 2.070628 -0.911591
C  2.832755 -0.394224 -0.468966
C  0.855334 2.951742 0.358425
C  -2.056508 0.839451 -0.429034
C  1.344609 -2.783494 0.240637
C  -1.928831 -1.954103 0.222155
C  3.467591 -1.642682 -0.194875
C  2.747665 -2.819802 0.155856
C  -3.230607 0.103092 -0.16968
C  -3.170072 -1.297363 0.131537
C  3.689912 0.803399 -0.846565
C  1.796109 5.06763 1.181579
C  0.11304 5.107166 -0.59234
C  5.601422 -2.86326 -0.016151
C  -5.242009 0.844982 0.993081
C  -5.2124 -2.229579 -0.800782
H  1.657243 2.17168 -1.499664
H  -0.094042 2.422092 -1.552133
H  -0.095302 2.887518 0.947202
H  1.654538 2.528749 0.995249
H  -2.150805 1.904687 -0.657792
H  0.786412 -3.686751 0.509108
H  -1.918708 -3.020579 0.468032
H  3.275872 -3.754943 0.358656
H  3.59162 1.055933 -1.919899
H  3.432159 1.705558 -0.264442
H  4.74925 0.570984 -0.664044
H  2.669207 4.513414 1.568839
H  1.073364 5.209678 2.024639
H  2.141718 6.066234 0.858953
H  0.463499 6.122429 -0.849207
H  -0.777007 5.20706 0.080469
H  -0.216819 4.624367 -1.528087
H  5.431767 -3.203311 1.02428
H  6.663684 -2.610976 -0.153847
H  5.317743 -3.670465 -0.719521
H  -4.686779 1.431941 1.749957
H  -5.443364 -0.170189 1.378866
H  -6.182439 1.357381 0.737536
H  -4.673015 -2.811613 -1.572795
H  -5.525422 -1.254807 -1.217718
H  -6.088162 -2.796454 -0.448139
