program: Gaussian 09
title: 000038770
version: EM64L-G09RevD.01
frameworkgroup: C1[X(C9H9NO2S2)]
method: RPBEPBE
basis: SDD
operation: Freq
keyword: #p
keyword: freq=noraman
keyword: PBEPBE/SDD
title: #p freq=noraman PBEPBE/SDD
converged: YES YES NO NO
title: Mulliken charges:
elementType: S S O O N C C C C C C C C C H H H H H H H H H
charge: 0.225601 0.241588 -0.209392 -0.208271 0.027098 -0.949489 0.628844 -0.620319 -0.628888 -0.421850 -0.283174 -0.347457 -0.355170 0.378337 0.339243 0.278261 0.269675 0.279985 0.271935 0.246070 0.263672 0.287937 0.285765
chargesum: 0.00000
title: Mulliken charges with hydrogens summed into heavy atoms:
elementType: S S O O N C C C C C C C C C
charge: 0.225601 0.241588 -0.209392 -0.208271 0.027098 -0.610245 0.628844 -0.072384 -0.076968 -0.175780 -0.019502 -0.059520 -0.069405 0.378337
polarizability: 2.42387999e+02 -9.52260408e+00 1.26639448e+02 -1.14477330e-03 7.70618823e+00 9.65360378e+01
1716.lowfreq: -13.0078 -4.7398 -0.0018 -0.0014 -0.0008 4.5540 22.7235 30.9978 55.6047
frequency: 22.1734 30.9176 55.5842 69.6719 124.0403 151.3239 200.4559 239.2243 280.1404 310.7408 380.1532 406.8699 411.4570 441.0558 491.9743 502.9062 611.1130 621.4974 630.0619 633.9940 650.5769 673.5985 696.2652 756.0329 769.6151 832.5238 843.3210 853.9300 871.4911 951.2314 984.3367 990.3313 1003.8789 1004.4237 1092.2906 1103.2993 1107.2055 1143.5145 1159.8902 1177.8369 1204.5226 1219.7038 1236.5990 1260.3102 1290.4109 1303.4296 1365.4383 1406.2404 1418.8625 1429.8750 1440.1374 1476.8459 1594.7014 1605.8267 3026.4372 3034.2536 3070.2124 3099.9235 3117.7861 3140.0009 3158.3041 3183.9664 3186.5631
redmass: 4.9953 4.6020 10.4844 6.4434 10.1942 8.9788 10.4309 2.1274 5.8864 6.6775 14.7981 2.8748 9.0774 3.4880 3.8563 7.7935 6.4804 6.0152 7.0978 4.2465 6.5294 4.0864 5.8732 4.2903 8.6060 5.4256 1.2667 1.5658 1.7524 1.4656 1.3489 1.3775 2.9816 2.3692 3.2661 1.0536 1.3092 1.3453 1.1170 1.2926 1.9927 4.8650 1.8213 1.2419 1.1759 1.2971 7.3825 7.9345 3.2883 1.0875 1.1015 2.4470 7.4913 6.4816 1.0552 1.0590 1.0873 1.1077 1.1083 1.0907 1.0897 1.0945 1.0960
irintensity: 1.0823 1.6850 0.2448 0.0509 4.3948 4.6378 1.6747 2.1173 0.3265 0.2641 0.3788 0.0953 8.5634 1.2408 4.5988 0.6624 1.1169 3.9877 0.5093 0.1750 2.9506 44.3730 8.1599 2.2920 45.3135 0.3624 0.1822 3.8794 45.9357 8.3519 4.0653 0.3902 5.2829 3.2390 17.7682 1.7948 19.3983 1.2813 4.7341 56.4319 21.9741 360.0982 2.5859 5.0978 14.5371 1.1046 87.9064 1.4604 61.6591 12.6706 6.8868 3.9597 6.3246 47.4811 13.1012 34.2711 6.3557 0.2264 15.8141 8.0976 2.8302 0.0407 3.8448
temp: 298.150 k
press: 1.00000 atm
elementType: 16 16 8 8 7 6 6 6 6 6 6 6 6 6 1 1 1 1 1 1 1 1 1
symmnumber: 1
zpe: 433953.1 jmol-1
zpe.correction: 0.165284 hartree
zpe.thermalcorrener: 0.178262 hartree
zpe.thermalcorrenthalpy: 0.179206 hartree
zpe.thermalcorrgfe: 0.122981 hartree
zpe.sumelectzpe: -1348.573799 hartree
zpe.sumelectthermal: -1348.560821 hartree
zpe.sumelectthermalent: -1348.559877 hartree
zpe.sumelectthermalfe: -1348.616102 hartree
dipole: 7.0182 0.5695 -0.0632
dipole: 7.0416
quadrupole: -109.7501 -90.6369 -101.7209
quadrupole: -7.4650 -2.4813 2.4117
quadrupole: -9.0474 10.0657 -1.0183 -7.4650 -2.4813 2.4117
hfenergy: -1348.7390829 hartree
pointgroup: C01 [X(C9H9N1O2S2)]
dipole: -2.7654081 0.1588329 0.0471482 debye
dipolederiv: -0.4005723 -0.0335821 -0.0132185 -0.0622703 -0.1798256 -0.0274945 -0.0518763 -0.0545758 -0.1518319 -0.3043678 -0.0207728 0.0329204 -0.0333145 -0.1462055 -0.1073375 0.0009581 -0.0406845 -0.1516181 -0.9169189 -0.1959869 0.003847 -0.2680534 -0.6007467 0.0175552 0.0124897 0.0240301 -0.2311088 -0.7300286 0.1847898 -0.017395 0.3076828 -0.723894 0.0428136 -0.0247512 0.0347413 -0.2314106 2.0775881 -0.0718052 0.0309362 -0.1725335 1.096779 -0.0667655 0.0251029 -0.0617027 0.194141 0.4462353 0.0567834 -0.0197749 -0.0107504 0.2062375 0.0554987 -0.0151711 0.061304 0.2972794 0.4833378 0.0526473 0.0082122 -0.0281859 0.0293361 0.0047038 0.0569645 -0.0120332 -0.0759128 0.0783247 0.0436682 -0.0785885 0.168886 0.1618134 -0.0807993 -0.2106495 -0.1335722 -0.0110484 0.1973676 0.0052859 0.1100145 -0.0567693 0.0938883 0.0993372 0.2523481 -0.0009823 0.0442522 -0.4181036 -0.1609103 0.0047577 -0.1424459 0.1106829 -0.0197466 0.0102476 -0.0165598 -0.1258923 -0.2400034 0.1764296 -0.0284146 0.3092145 -0.0543166 0.0086208 0.0021355 0.0020171 -0.0890668 0.1993245 0.0998335 -0.0044675 -0.2253316 -0.0409363 -0.0001949 0.0222292 -0.0018736 -0.0787638 0.2349387 -0.157888 0.0301365 0.1594008 -0.0203457 0.001952 -0.0134589 -0.007501 -0.0967915 -0.8700962 0.0960727 -0.0292847 0.15906 0.0332003 -0.0052535 -0.0101699 0.0024856 0.0500023 -0.0118815 -0.0623836 -0.0054707 -0.0103934 -0.0851011 0.0004517 0.007964 0.0100195 -0.046692 0.0379918 0.0440698 0.0292122 -0.009836 -0.1013068 0.0277207 0.0712208 0.0946036 0.0431516 -0.062442 -0.0454948 -0.0728731 -0.073073 0.0851709 -0.0218262 -0.0604584 -0.0169367 0.0177152 -0.0535763 0.0454847 -0.0370559 0.0901641 -0.0446204 -0.0127177 -0.1280096 0.026018 0.0474885 -0.023092 -0.0496019 0.0612729 -0.0652968 0.0672503 0.0515163 0.0699293 0.0605965 0.0062997 0.0575576 0.0886184 -0.0061886 0.0763695 -0.038018 0.01185 -0.0069891 0.0124129 0.1351564 0.0405997 -0.0771187 0.0011595 -0.0972539 0.026907 0.0057892 -0.0000707 0.0042503 0.1229177 0.0745705 -0.0663621 0.00357 -0.0284287 0.0774622 0.0063543 -0.0028538 0.00614 0.1686586 0.1032464 0.0482229 -0.0033072 0.0131588 0.0465887 0.0079721 -0.0071315 0.0078028 0.1630744 unknown
polarizability: 241.9198821|11.8566369|128.6965845|2.0566128|-2.8490058|94.9470186 unknown
InChI: InChI=1S/C9H9NO2S2/c11-10(12)8-3-1-7(2-4-8)9-13-5-6-14-9/h1-4,9H,5-6H2
charge 0 multiplicity 1
23 atoms
S  -2.923056 -0.089678 -1.582663
S  -2.892633 0.076587 1.522211
O  4.445099 0.780511 -0.029136
O  4.067159 -1.464401 0.122478
N  3.657926 -0.242021 0.03684
C  -2.063366 0.72799 -0.061655
C  -0.575898 0.459504 -0.031835
C  -4.221651 -1.072327 -0.612006
C  -4.535893 -0.31189 0.678043
C  0.332541 1.546698 -0.101744
C  -0.069305 -0.864657 0.060719
C  1.724794 1.327736 -0.080248
C  1.31462 -1.10322 0.08511
C  2.195071 0.001738 0.013589
H  -2.26964 1.80571 -0.144243
H  -3.828662 -2.079179 -0.401889
H  -5.106232 -1.139854 -1.268691
H  -5.07265 0.628769 0.476185
H  -5.111563 -0.927097 1.391202
H  -0.051487 2.570531 -0.172772
H  -0.773394 -1.700807 0.110908
H  2.441316 2.151331 -0.133209
H  1.726802 -2.112976 0.156707
