program: Gaussian 09
title: 000038755
version: EM64L-G09RevD.01
frameworkgroup: C1[X(C8H16O2)]
method: RPBEPBE
basis: SDD
operation: Freq
keyword: #pfreq=noraman
keyword: PBEPBE/SDD
title: #p freq=noraman PBEPBE/SDD
converged: YES YES NO NO
title: Mulliken charges:
elementType: O O C C C C C C C C H H H H H H H H H H H H H H H H
charge: -0.418264 -0.233092 -0.003724 -0.385957 -0.424894 -0.508017 -0.375251 -0.713590 -0.697329 0.161743 0.224831 0.196774 0.186755 0.210978 0.216116 0.236596 0.233391 0.209366 0.198957 0.215693 0.237076 0.216526 0.211055 0.217588 0.209683 0.376989
chargesum: 0.00000
title: Mulliken charges with hydrogens summed into heavy atoms:
elementType: O O C C C C C C C C
charge: -0.041275 -0.233092 0.221107 -0.002428 0.002200 -0.038030 0.033073 -0.044294 -0.059003 0.161743
polarizability: 1.10483546e+02 3.38646557e+00 8.78618715e+01 1.69945479e+00 -3.04413774e+00 7.92221596e+01
1716.lowfreq: -8.7749 -0.0010 -0.0007 0.0008 6.6085 13.5401 29.8851 46.0995 61.2109
frequency: 29.4901 45.7882 60.7437 68.7916 109.3999 142.5593 188.3177 230.7531 241.1006 264.9627 301.5280 347.6519 399.4832 454.2901 520.5087 550.3615 603.9330 680.3575 735.1870 774.2495 782.8356 829.7012 868.4405 894.6117 940.5353 970.1284 988.1464 1021.0146 1047.0891 1051.9340 1092.7166 1129.3975 1144.5735 1152.9689 1191.6534 1227.6119 1254.3121 1270.1441 1285.4994 1292.2476 1305.6096 1328.7175 1336.2206 1356.3176 1362.0761 1387.0805 1396.4942 1447.6095 1466.8516 1472.8802 1476.9317 1480.4714 1484.7498 1490.3979 1493.5741 1663.2709 2955.8629 2970.6827 2971.7329 2972.0056 2982.7129 2986.9498 3003.5825 3012.1980 3025.9303 3031.5179 3068.8183 3072.1574 3073.6092 3081.5104 3088.9446 3511.7826
redmass: 6.2443 4.1567 2.0710 2.2383 3.7443 1.8453 2.8202 1.1986 1.4031 2.3446 2.6275 2.6379 2.4265 2.6741 2.3409 3.3142 1.3370 2.9253 1.1615 1.4078 1.9071 3.7384 1.4020 1.8723 1.8779 2.0544 2.0167 1.4628 1.8361 2.1526 2.0538 1.9206 2.8369 1.8724 1.2596 1.3593 1.2741 1.1796 1.1406 1.3791 1.7944 1.3671 1.5837 1.5250 1.3495 1.2126 1.2239 1.0950 1.0694 1.0618 1.0443 1.0554 1.0686 1.0693 1.0599 8.2876 1.0592 1.0545 1.0559 1.0590 1.0424 1.0679 1.0958 1.0608 1.0987 1.1017 1.1008 1.0995 1.0989 1.1003 1.1004 1.0639
irintensity: 0.8186 0.6057 0.0234 0.0264 0.0531 0.0797 0.0998 0.0263 0.1735 0.3050 0.4107 1.0381 4.4685 4.2284 8.3399 37.9499 103.5408 50.5918 8.8492 7.5214 2.0684 23.0726 0.7770 21.3729 8.1142 6.6573 3.5134 3.1501 132.4285 23.2325 4.5949 54.4478 13.5055 2.5372 16.6541 0.4209 5.4520 1.8866 0.2080 13.5665 41.3280 4.6138 10.7377 0.9202 1.4205 10.3459 17.6156 9.1574 3.2505 6.1042 12.7332 4.7202 29.7585 2.7393 9.4698 236.1899 18.4101 66.2571 8.0948 12.4059 43.4942 16.0763 20.3549 16.0032 29.2030 34.4085 78.4895 47.5938 43.1583 53.6181 19.1951 21.2728
temp: 298.150 k
press: 1.00000 atm
elementType: 8 8 6 6 6 6 6 6 6 6 1 1 1 1 1 1 1 1 1 1 1 1 1 1 1 1
symmnumber: 1
zpe: 597799.5 jmol-1
zpe.correction: 0.227690 hartree
zpe.thermalcorrener: 0.240271 hartree
zpe.thermalcorrenthalpy: 0.241215 hartree
zpe.thermalcorrgfe: 0.187502 hartree
zpe.sumelectzpe: -464.078136 hartree
zpe.sumelectthermal: -464.065555 hartree
zpe.sumelectthermalent: -464.064611 hartree
zpe.sumelectthermalfe: -464.118324 hartree
dipole: -1.5048 -0.9770 0.7305
dipole: 1.9371
quadrupole: -66.3090 -64.2572 -61.7887
quadrupole: -5.1495 4.9139 1.1553
quadrupole: -2.1907 -0.1389 2.3296 -5.1495 4.9139 1.1553
hfenergy: -464.3058261 hartree
pointgroup: C01 [X(C8H16O2)]
dipole: -0.597617 0.3816819 -0.2793167 debye
dipolederiv: -0.3742573 -0.2321384 0.1068463 -0.1988085 -0.7986776 0.3571039 0.1278368 0.4343918 -0.7454095 -0.837237 0.2862504 -0.1351778 0.1876171 -0.6618822 0.2497656 0.1100218 0.153637 -0.4525024 0.2404347 0.0451545 0.0425916 0.0338039 0.1332158 0.0024685 0.1481275 0.0325141 0.0883938 -0.049759 -0.0066681 -0.0018951 -0.0108558 0.134517 -0.046749 -0.0722531 -0.05682 0.0722605 0.0671204 0.0112174 0.0012432 0.0025616 0.0695962 -0.0164132 0.001804 -0.0494611 0.0624252 -0.4621124 0.0023477 0.0374182 0.0392812 0.0550473 -0.0376065 -0.0154986 -0.0248307 0.0268994 0.0063542 0.0054924 0.0026341 0.0101845 0.152497 -0.0368187 0.0698656 -0.0320752 0.0956184 0.0842144 -0.0016541 -0.0025046 0.0023784 -0.0656572 0.0524039 -0.0099015 0.0588777 -0.001223 -0.0586417 0.0244908 0.0347461 0.0187579 0.0887614 -0.0117603 -0.0110769 -0.0091202 0.0637191 1.187517 -0.1558786 -0.1340288 -0.1759906 1.0214226 -0.618463 -0.4176884 -0.6305116 0.7403571 0.0393567 -0.0026538 -0.0083056 0.0086359 -0.0770873 0.0923158 0.0091507 0.0837703 -0.0726774 0.0288529 -0.0069624 -0.006051 -0.0251781 -0.0051464 0.1376752 -0.0035485 0.1093934 -0.0908147 0.038704 0.0122793 -0.0003147 0.0142068 -0.1661711 -0.115292 -0.0054551 -0.0911271 0.014605 -0.0371514 -0.0457889 -0.1574464 -0.0521966 0.0133576 -0.0042187 -0.1502737 0.010089 -0.0561382 -0.1321043 0.0233226 0.1409506 0.0230808 0.0147568 0.0178895 0.1178759 0.0277287 0.0045582 0.0467531 -0.004098 0.0158363 0.0119152 0.0367629 0.1192135 0.0218654 0.0769445 -0.0237407 0.0856081 0.0196045 0.0163122 -0.0053985 -0.093087 -0.0812743 0.0348525 -0.048654 0.0679804 0.0527101 0.0063774 0.0019514 0.0011976 -0.15944 -0.0989536 -0.002538 -0.0780275 0.0254286 0.0242895 -0.0296457 0.0556488 -0.0100807 0.0030695 0.1246335 0.019014 0.1014076 -0.1205193 -0.1123581 -0.0245957 0.1164869 0.0065306 0.098698 0.0014218 0.1167498 0.0221107 0.0022841 -0.0373506 0.0065527 -0.114692 -0.0253536 0.1055319 -0.0177898 -0.1114593 0.0112269 -0.0299846 0.0886801 0.0219939 0.0100621 0.0186178 -0.1546562 -0.084893 0.0130125 -0.1248429 0.0346074 0.0757872 0.0076028 0.0103042 -0.02524 -0.0004548 0.129783 0.0731222 0.1084811 -0.0970591 -0.1650312 -0.0066736 -0.1011782 -0.0232174 0.0920577 -0.025847 -0.1405591 -0.0203975 -0.0013976 0.0712976 -0.0333824 0.0009389 0.0354076 -0.1617162 -0.0846411 0.0361653 -0.0768592 0.0591272 0.1283229 0.0774535 0.0676232 0.1381429 0.3246845 -0.0039538 0.0407879 0.0121544 0.3332023 unknown
polarizability: 110.4143679|-3.4431195|87.8081448|-2.253977|-3.0500803|79.3450646 unknown
InChI: InChI=1S/C8H16O2/c1-3-5-7(4-2)6-8(9)10/h7,9H,3-6H2,1-2H3
charge 0 multiplicity 1
26 atoms
O  2.524945 1.429578 -0.812859
O  3.180083 -0.410486 0.440172
C  -0.21961 0.22506 -0.229688
C  -1.584785 0.437629 0.479465
C  -0.050216 -1.190444 -0.853127
C  0.927734 0.569187 0.775548
C  -2.818449 0.251615 -0.433645
C  -0.095529 -2.369126 0.146165
C  -4.137865 0.621372 0.279072
C  2.306057 0.44255 0.16814
H  -0.151396 0.958201 -1.060191
H  -1.667931 -0.245677 1.349901
H  -1.60795 1.46725 0.895235
H  -0.836324 -1.330203 -1.620337
H  0.912813 -1.225047 -1.401086
H  0.884884 -0.097931 1.652843
H  0.790341 1.610462 1.121931
H  -2.875126 -0.798111 -0.782156
H  -2.698264 0.877666 -1.341459
H  -1.048947 -2.398852 0.705074
H  0.731625 -2.31418 0.876538
H  0.004537 -3.330617 -0.389666
H  -4.288426 -0.001157 1.181379
H  -5.010708 0.472977 -0.382897
H  -4.132839 1.680178 0.600212
H  3.434945 1.305304 -1.197864
