program: Gaussian 09
title: 000038723
version: EM64L-G09RevD.01
frameworkgroup: C1[X(CClIN2O4)]
method: RPBEPBE
basis: SDD
operation: Freq
keyword: #p
keyword: freq=noraman
keyword: PBEPBE/SDD
title: #p freq=noraman PBEPBE/SDD
converged: NO YES NO NO
title: Mulliken charges:
elementType: I Cl O O O O N N C
charge: 0.345291 0.194574 -0.137522 -0.136387 -0.123018 -0.127964 0.213695 0.223844 -0.452512
chargesum: 0.00000
title: Mulliken charges with hydrogens summed into heavy atoms:
polarizability: 9.83458647e+01 -7.58403082e+00 6.41895847e+01 5.41099428e+00 -7.65210598e+00 6.12337861e+01
1716.lowfreq: 0.0003 0.0008 0.0012 5.8033 9.6298 12.7657 38.1693 67.7360 132.6887
frequency: 38.0407 67.7182 132.6875 142.1543 181.1135 196.1085 223.1997 279.8337 348.3864 381.1696 513.1697 579.6989 666.4594 721.4783 728.0241 766.2841 806.0306 1155.7105 1187.6168 1453.2546 1465.2389
redmass: 16.4357 16.7361 19.7633 19.6967 26.1941 22.6782 19.1532 17.8873 17.8224 16.1397 14.4155 14.0996 13.5678 14.4460 14.5509 13.5844 12.7078 15.2022 15.1125 14.6282 14.5978
irintensity: 0.0538 0.1415 0.1187 1.1981 1.3403 0.3303 0.6418 2.8510 0.5302 1.1287 30.5798 13.3467 4.4897 62.7565 77.6061 0.9206 153.4369 127.7795 115.9621 216.7514 31.0635
temp: 298.150 k
press: 1.00000 atm
elementType: 53 17 8 8 8 8 7 7 6
symmnumber: 1
zpe: 71975.6 jmol-1
zpe.correction: 0.027414 hartree
zpe.thermalcorrener: 0.036990 hartree
zpe.thermalcorrenthalpy: 0.037934 hartree
zpe.thermalcorrgfe: -0.010353 hartree
zpe.sumelectzpe: -919.156319 hartree
zpe.sumelectthermal: -919.146743 hartree
zpe.sumelectthermalent: -919.145799 hartree
zpe.sumelectthermalfe: -919.194086 hartree
dipole: -2.7523 -0.5704 1.5649
dipole: 3.2170
quadrupole: -70.6582 -78.5316 -72.7509
quadrupole: 0.8433 3.0150 -0.1975
quadrupole: 3.3220 -4.5514 1.2294 0.8433 3.0150 -0.1975
hfenergy: -919.1837334 hartree
pointgroup: C01 [X(C1Cl1I1N2O4)]
dipole: 0.1194832 -1.2557045 -0.1042609 debye
dipolederiv: 0.103079 0.0370319 -0.0052344 0.0218532 -0.3097229 0.2410112 -0.0000449 0.2842147 -0.0591749 -0.0502836 -0.0096255 0.0201337 -0.0111893 -0.1066333 -0.0165523 0.0440171 -0.0684178 -0.6911766 -0.4599173 0.1651751 0.0582594 0.1097695 -0.31584 -0.2525958 -0.0133254 -0.2821443 -0.5748871 -0.4258498 -0.2103279 -0.0543408 -0.0616799 -0.7296015 0.2243711 -0.1272139 0.1240769 -0.2346934 -0.7190649 0.1474006 -0.2541746 0.1395671 -0.1979427 -0.0699927 -0.173269 -0.1075285 -0.4031361 -0.6663608 -0.0203565 -0.245252 -0.0477405 -0.3785929 0.0673091 -0.2832441 0.0939375 -0.2545731 1.2344606 -0.5765654 0.1895813 -0.362501 0.3333028 0.3533362 0.1499757 0.5076423 0.7358146 1.1201043 0.4624503 0.3728108 0.1947161 0.9155117 -0.2317142 0.5239281 -0.1076186 0.2269624 -0.1361674 0.0048175 -0.0817834 0.0172047 0.7895188 -0.3151725 -0.1208238 -0.4441622 1.2548643 unknown
polarizability: 61.2104564|-5.5341185|85.037816|11.5697334|-16.0603615|77.520963 unknown
InChI: InChI=1S/CClIN2O4/c2-1(3,4(6)7)5(8)9
charge 0 multiplicity 1
9 atoms
I  0.230148 -2.341752 0.927278
Cl 0.000134 -0.81532 -2.043628
O  -1.182031 0.80147 1.379643
O  1.029556 1.679292 -0.481855
O  -2.290846 0.251257 -0.546018
O  2.227948 0.150429 0.727685
N  -1.287308 0.261292 0.226576
N  1.231355 0.535228 0.048457
C  0.041043 -0.521797 -0.238337
