program: Gaussian 09
title: 000038758
version: EM64L-G09RevD.01
frameworkgroup: C1[X(C13H19O5PS)]
method: RPBEPBE
basis: SDD
operation: Freq
keyword: #p
keyword: freq=noraman
keyword: PBEPBE/SDD
title: #p freq=noraman PBEPBE/SDD
converged: YES YES NO NO
title: Mulliken charges:
elementType: S P O O O O O C C C C C C C C C C C C C H H H H H H H H H H H H H H H H H H H
charge: 0.021474 1.010198 -0.508837 -0.470106 -0.588268 -0.291649 -0.255764 -0.673742 -0.283356 0.370386 -0.669989 -0.221781 -0.323795 -0.363653 0.240602 -0.337904 -0.309920 -0.652404 0.178944 -0.500913 0.268739 0.295640 0.241252 0.214057 0.206105 0.226239 0.222094 0.227352 0.231234 0.288502 0.259219 0.272688 0.274932 0.236634 0.238944 0.211113 0.242085 0.230665 0.242986
chargesum: 0.00000
title: Mulliken charges with hydrogens summed into heavy atoms:
elementType: S P O O O O O C C C C C C C C C C C C C
charge: 0.021474 1.010198 -0.508837 -0.470106 -0.588268 -0.291649 -0.255764 -0.109364 0.171952 0.370386 -0.015551 0.236805 -0.035293 -0.104434 0.240602 -0.065216 -0.034988 0.034287 0.178944 0.214822
polarizability: 3.13872272e+02 -7.80389246e+00 1.70023845e+02 -7.67206107e+00 -1.33800990e+01 1.73045565e+02
1716.lowfreq: -12.5505 -2.7784 -0.0029 -0.0018 -0.0017 3.5007 6.9411 12.5072 18.2360
frequency: -6.1274 11.9427 18.0967 38.5526 48.1039 50.1275 63.9785 69.2193 73.7941 84.5139 100.6336 113.7445 127.3982 140.8120 158.7558 177.4676 196.2458 212.9169 223.6690 238.4216 246.0051 260.7164 286.2924 300.3968 318.3537 328.7845 350.9514 381.4729 406.1412 413.4936 456.8719 495.1168 503.4634 549.2701 625.2822 646.9448 660.4892 675.5286 677.5755 731.7201 751.7937 760.1339 817.2222 826.7537 841.8764 846.2870 864.9096 870.7448 897.4276 922.6082 980.6840 992.4883 1005.9771 1013.5805 1033.2562 1039.3422 1068.9985 1072.6385 1105.2769 1109.4545 1114.1258 1114.4346 1132.8266 1147.4887 1168.1108 1193.6414 1221.9001 1255.4711 1257.0010 1260.4388 1291.1809 1301.6883 1332.7620 1356.5447 1376.3043 1388.6017 1396.5469 1418.1374 1423.9659 1428.6749 1451.8573 1456.6624 1464.5609 1469.8621 1475.5260 1476.8973 1482.4555 1486.3407 1488.8514 1576.2208 1610.4702 1624.6950 2978.5744 2985.7531 2998.1054 3003.2248 3003.3165 3022.5217 3051.8150 3051.9803 3077.8141 3083.2062 3094.5947 3103.9977 3104.0443 3114.4069 3146.7964 3149.3013 3163.0666 3167.4964 3184.3769
redmass: 4.2989 4.9648 4.5500 2.9129 2.5564 3.5750 3.3265 2.3615 2.9241 2.5328 1.5250 4.2956 6.1839 6.4185 4.1599 3.4374 3.7654 1.1479 2.9414 4.3644 1.7410 3.5233 7.8276 5.3929 6.5907 7.1711 5.2969 7.9567 5.3441 3.2301 8.7350 6.7532 3.6527 7.9365 7.3462 5.2665 6.5859 4.5276 7.4619 1.1010 4.5199 6.1855 1.0928 6.9926 1.2642 1.2268 1.7554 3.4762 1.8690 8.0312 1.3507 1.3509 3.1887 2.6761 10.0618 2.9504 3.9678 1.3168 2.2574 2.2190 1.3288 1.2643 1.4214 1.4774 1.9120 1.7163 1.3465 2.7094 1.3484 1.1567 1.1053 1.2835 1.3806 1.2497 6.2877 1.2004 1.2359 3.8596 1.1868 1.0897 1.0497 1.0392 1.0520 1.0588 1.0439 1.0598 1.0714 1.2371 1.9044 7.9673 6.3199 10.0462 1.0356 1.0552 1.0375 1.0607 1.0296 1.0581 1.1007 1.1079 1.1015 1.0996 1.0980 1.1071 1.1044 1.1022 1.1046 1.0898 1.0887 1.0968 1.0972
irintensity: 1.2764 0.0634 0.5876 0.4010 0.7333 0.3288 1.6100 2.8333 0.1867 0.7746 0.2726 0.1955 0.1196 1.9500 6.1269 11.9115 0.7911 1.5857 0.4015 9.7291 6.3660 18.3384 4.7395 19.5848 0.6336 17.1169 1.7024 15.8634 11.9230 1.9147 97.5671 94.8747 43.9337 6.2174 47.7766 54.3809 82.3946 18.0078 121.3647 12.3965 19.1489 75.6723 0.5041 246.9675 2.6157 3.2177 13.1674 186.9257 16.1465 5.7524 0.2038 0.0785 66.2934 125.8328 77.5998 3.8597 195.4502 2.1004 11.0571 4.6537 26.1554 0.2511 7.1209 128.0834 295.5547 64.9092 0.0902 368.9070 32.1307 4.5371 1.8689 1.8861 7.8473 5.1226 27.4601 12.3033 23.9982 13.1902 47.0614 11.2813 13.7824 11.6073 12.8736 3.4469 13.2565 7.4658 13.6539 21.6564 84.9414 3.1761 228.5711 211.2834 38.1526 19.2985 21.0471 10.5720 46.1430 17.0872 0.7627 18.7413 38.3598 35.6066 21.7267 12.6779 27.0087 29.5795 16.9761 0.9579 1.6771 0.4579 2.4811
temp: 298.150 k
press: 1.00000 atm
elementType: 16 15 8 8 8 8 8 6 6 6 6 6 6 6 6 6 6 6 6 6 1 1 1 1 1 1 1 1 1 1 1 1 1 1 1 1 1 1 1
symmnumber: 1
zpe: 792007.7 jmol-1
zpe.correction: 0.301660 hartree
zpe.thermalcorrener: 0.325020 hartree
zpe.thermalcorrenthalpy: 0.325964 hartree
zpe.thermalcorrgfe: 0.244832 hartree
zpe.sumelectzpe: -1620.647988 hartree
zpe.sumelectthermal: -1620.624628 hartree
zpe.sumelectthermalent: -1620.623684 hartree
zpe.sumelectthermalfe: -1620.704816 hartree
dipole: 1.5151 2.0568 -3.4229
dipole: 4.2711
quadrupole: -110.3477 -124.0868 -141.3688
quadrupole: -3.4569 8.5742 -0.1366
quadrupole: 14.9200 1.1810 -16.1010 -3.4569 8.5742 -0.1366
hfenergy: -1620.9496479 hartree
pointgroup: C01 [X(C13H19O5P1S1)]
dipole: 0.494214 -0.3654005 1.5639333 debye
polarizability: 313.5806023|-7.988852|161.5429408|8.6737866|-10.0347181|181.8181393 unknown
InChI: InChI=1S/C13H19O5PS/c1-4-10-20-19(15,17-5-2)18-12-8-6-11(7-9-12)13(14)16-3/h6-9H,4-5,10H2,1-3H3
charge 0 multiplicity 1
39 atoms
S  4.216594 -0.642958 1.390945
P  2.487705 -0.980042 -0.051347
O  1.250053 -0.137343 0.88135
O  1.987778 -2.632006 0.041535
O  2.711697 -0.534411 -1.558972
O  -5.012107 1.045596 0.445476
O  -4.630419 0.664815 -1.822081
C  5.432455 0.03889 0.073522
C  5.2422 1.539017 -0.18607
C  -0.085514 0.046301 0.438513
C  6.298819 2.062612 -1.186753
C  1.848207 -3.29359 1.376261
C  -0.481381 -0.043831 -0.918161
C  -1.012497 0.371873 1.45654
C  -2.779151 0.504263 -0.236798
C  -1.832179 0.18153 -1.242803
C  -2.357219 0.602919 1.115666
C  1.466759 -4.741044 1.083909
C  -4.190242 0.733814 -0.646995
C  -6.434474 1.2889 0.11587
H  6.422828 -0.192872 0.504495
H  5.290408 -0.55473 -0.845328
H  4.228342 1.710451 -0.591765
H  5.313155 2.094529 0.767766
H  7.326468 1.921125 -0.802173
H  6.153303 3.141925 -1.371351
H  6.221145 1.541151 -2.158417
H  2.814589 -3.21988 1.912229
H  1.065901 -2.769445 1.956602
H  0.249693 -0.271432 -1.700652
H  -0.662685 0.442941 2.490327
H  -2.172751 0.117294 -2.281227
H  -3.08841 0.856895 1.887501
H  2.249616 -5.238484 0.487518
H  0.5169 -4.787899 0.525652
H  1.343265 -5.292891 2.03417
H  -6.880287 0.390642 -0.343836
H  -6.910906 1.51979 1.079064
H  -6.525956 2.134484 -0.586582
