program: Gaussian 09
title: 000038712
version: EM64L-G09RevD.01
frameworkgroup: C1[X(C11H12BrNO2)]
method: RPBEPBE
basis: SDD
operation: Freq
keyword: #p
keyword: freq=noraman
keyword: PBEPBE/SDD
title: #p freq=noraman PBEPBE/SDD
converged: YES YES NO NO
title: Mulliken charges:
elementType: Br O O N C C C C C C C C C C C H H H H H H H H H H H H
charge: 0.004508 -0.282468 -0.269720 -0.615630 0.049881 0.353964 0.192327 -0.354628 -0.339186 -0.217566 -0.793112 0.158394 -0.355671 -0.043412 -0.553086 0.258697 0.277762 0.223062 0.255356 0.232641 0.282027 0.195089 0.226299 0.334225 0.336387 0.216217 0.227643
chargesum: 0.00000
title: Mulliken charges with hydrogens summed into heavy atoms:
elementType: Br O O N C C C C C C C C C C C
charge: 0.004508 -0.282468 -0.269720 0.054982 0.049881 0.353964 0.192327 -0.095931 -0.061424 -0.217566 -0.082053 0.158394 0.121445 0.182887 -0.109226
polarizability: 2.32406684e+02 -3.93523326e+00 1.50156469e+02 2.36965978e+00 -3.15170292e+00 7.74599312e+01
1716.lowfreq: -30.9461 -6.6629 0.0007 0.0007 0.0007 3.0805 13.4540 22.5897 39.0741
frequency: -26.4450 22.5482 39.0612 63.1939 73.5664 103.7127 118.9223 143.4187 159.1593 191.1583 200.4174 224.6271 274.1658 302.4899 315.6042 345.4144 408.2546 443.1389 459.6255 513.0367 526.4771 553.0898 571.9833 603.8910 611.1318 617.1811 692.5436 744.0303 772.7607 819.1049 881.6025 891.3009 896.4342 908.6083 934.8293 961.6898 976.8097 1002.2807 1008.4376 1045.4682 1059.7502 1101.4473 1141.3502 1163.4174 1203.2275 1213.6703 1247.4212 1281.9347 1331.9930 1337.8785 1360.3132 1397.1637 1401.8822 1422.7627 1434.3728 1455.2565 1475.2260 1485.8974 1567.0705 1580.5754 1585.6877 1630.4071 1663.1219 2955.5515 2985.6791 3063.2130 3065.6491 3091.6762 3099.0879 3113.1401 3157.3499 3160.3127 3202.6769 3516.1918 3671.8216
redmass: 1.1019 3.7558 5.2304 5.3737 2.3098 3.9886 5.3066 4.5263 3.9667 5.2306 3.4633 5.1048 4.4825 3.8020 6.0614 4.1481 2.9686 3.4476 3.6940 4.0979 1.1852 2.8161 3.1560 1.7452 1.5483 4.7563 3.4880 6.3967 5.1822 5.8980 1.5202 2.8317 1.4703 4.9190 1.6284 1.3893 1.6725 1.5902 1.2708 1.5430 1.8190 1.9649 1.5839 4.6204 1.9655 1.4151 1.7388 1.2687 2.3154 1.7381 6.2089 2.0076 1.8442 1.7456 1.6042 1.0542 1.1937 1.1006 4.9947 8.1675 1.9514 2.4604 4.7641 1.0637 1.0379 1.0988 1.0955 1.0604 1.1002 1.0944 1.0925 1.0926 1.1149 1.0448 1.1045
irintensity: 0.7552 0.3470 0.3419 11.5732 0.5288 2.1370 0.4381 5.5740 3.4064 1.7636 1.5015 5.8326 4.4010 0.2680 9.4777 1.0788 4.5520 2.4151 9.6626 12.9652 122.4386 5.3023 16.6226 65.8331 48.6419 12.4375 46.0498 12.4820 32.1738 40.9556 8.6860 44.0069 18.5127 16.8242 90.9151 55.7988 19.2635 4.0133 12.7965 5.2327 0.2862 8.5024 0.6259 223.5921 5.8540 42.1350 11.7285 0.8666 130.9155 34.5712 48.3903 11.7235 32.4249 59.8418 32.1061 12.5505 56.7732 12.9672 53.8949 3.3740 94.5976 303.6450 2.0422 42.5161 22.2276 14.7102 15.9257 12.9439 16.7005 10.2005 3.5385 0.4521 24.5721 45.7389 27.1683
temp: 298.150 k
press: 1.00000 atm
elementType: 35 8 8 7 6 6 6 6 6 6 6 6 6 6 6 1 1 1 1 1 1 1 1 1 1 1 1
symmnumber: 1
zpe: 538590.8 jmol-1
zpe.correction: 0.205138 hartree
zpe.thermalcorrener: 0.220462 hartree
zpe.thermalcorrenthalpy: 0.221406 hartree
zpe.thermalcorrgfe: 0.160214 hartree
zpe.sumelectzpe: -643.906455 hartree
zpe.sumelectthermal: -643.891132 hartree
zpe.sumelectthermalent: -643.890188 hartree
zpe.sumelectthermalfe: -643.951380 hartree
dipole: 0.2913 -0.3028 1.4104
dipole: 1.4717
quadrupole: -102.1939 -81.1144 -99.9207
quadrupole: 6.5375 1.5559 6.8121
quadrupole: -7.7842 13.2952 -5.5110 6.5375 1.5559 6.8121
hfenergy: -644.1115938 hartree
pointgroup: C01 [X(C11H12Br1N1O2)]
dipole: 0.1196068 -0.1401371 0.5489025 debye
polarizability: 232.126614|5.1720792|150.3916402|5.2217445|1.8026143|77.5048295 unknown
InChI: InChI=1S/C11H12BrNO2/c1-3-4-15-10-7(2)5-8(12)6-9(10)11(13)14/h3,5-6H,1,4,13H2,2H3
charge 0 multiplicity 1
27 atoms
Br 4.739662 0.35884 -0.142551
O  -1.31897 -0.66537 0.507476
O  -1.412807 2.19428 -0.550094
N  -0.048552 3.116199 1.083886
C  0.046673 -0.414566 0.269439
C  0.940089 -1.524159 0.230979
C  0.539301 0.917517 0.20245
C  2.329511 -1.278529 0.110075
C  1.935487 1.145924 0.089442
C  2.807061 0.044605 0.036329
C  0.406668 -2.936982 0.355752
C  -0.400836 2.102106 0.207859
C  -2.19015 -0.788856 -0.715192
C  -3.462428 -1.466651 -0.290622
C  -4.696726 -0.952818 -0.515588
H  3.028419 -2.1199 0.079911
H  2.320865 2.166664 0.010003
H  1.228594 -3.668122 0.431689
H  -0.239762 -3.030436 1.246032
H  -0.214701 -3.213371 -0.516661
H  -2.357059 0.226557 -1.114073
H  -1.643908 -1.399819 -1.465501
H  -3.346202 -2.436915 0.212694
H  0.693555 2.996583 1.7713
H  -0.629354 3.954322 1.113707
H  -5.60507 -1.492108 -0.22448
H  -4.830459 0.023207 -0.99766
