program: Gaussian 09
title: 000038695
version: EM64L-G09RevD.01
frameworkgroup: C1[X(C13H18N2O2)]
method: RPBEPBE
basis: SDD
operation: Freq
keyword: #p
keyword: freq=noraman
keyword: PBEPBE/SDD
title: #p freq=noraman PBEPBE/SDD
converged: YES YES NO NO
title: Mulliken charges:
elementType: O O N N C C C C C C C C C C C C C H H H H H H H H H H H H H H H H H H
charge: -0.401290 -0.284984 -0.052720 -0.112893 -0.374831 -0.364924 -0.380961 -0.380559 -0.399189 -0.372556 0.189478 0.219676 -0.347679 -0.358430 -0.230715 -0.224338 -0.226738 0.248497 0.176665 0.175793 0.226054 0.209644 0.190110 0.188714 0.204486 0.186969 0.214558 0.217164 0.253093 0.366494 0.288734 0.268892 0.227644 0.230177 0.229967
chargesum: 0.00000
title: Mulliken charges with hydrogens summed into heavy atoms:
elementType: O O N N C C C C C C C C C C C C C
charge: -0.034797 -0.284984 -0.052720 -0.112893 0.050331 0.036923 0.018793 0.012642 0.002338 0.097700 0.189478 0.219676 -0.058945 -0.089537 -0.003071 0.005839 0.003229
polarizability: 2.05039378e+02 -2.77488312e+00 1.56115923e+02 1.79067641e+01 9.40907346e-01 1.18938098e+02
1716.lowfreq: -10.4528 -5.5756 -0.0010 -0.0008 -0.0003 3.1634 19.4042 23.8036 29.6663
frequency: 17.8698 23.5510 29.5590 55.0258 65.1112 125.0702 131.2092 198.3759 213.5030 225.6774 253.9713 263.0589 286.8498 315.8744 358.1905 377.1404 404.7101 408.9670 424.2353 452.1981 475.0509 541.1450 577.0740 596.9820 615.5780 674.3082 696.9155 705.0081 752.0649 788.7129 803.7565 818.9810 845.8700 851.2596 861.8970 900.0065 944.2404 954.7467 971.9187 988.3607 990.2102 996.9277 1002.8244 1022.7865 1031.2735 1042.7677 1080.5414 1089.8122 1100.0212 1123.7920 1143.8474 1152.2958 1173.0120 1182.1225 1191.3214 1235.0642 1259.4274 1269.8301 1292.1151 1304.2518 1316.5259 1324.3456 1330.0899 1335.9126 1337.3608 1347.3110 1369.8373 1377.8619 1380.1640 1390.6734 1432.0786 1442.3654 1450.1525 1459.3112 1464.4567 1466.6958 1476.5178 1477.8645 1532.5801 1588.6125 1608.1348 2836.8686 2844.8458 2961.4933 2983.3545 2987.5263 2988.3041 3030.9334 3042.5871 3047.4635 3051.7531 3057.0780 3078.3305 3126.4236 3138.7971 3153.7602 3166.5584 3185.7512 3482.4850
redmass: 3.8825 4.2602 3.6941 5.1949 4.6727 4.6791 4.5188 4.9497 2.4073 2.2202 3.4663 1.3429 5.6562 3.9027 1.7101 4.5740 2.7096 2.5334 3.1775 2.5022 3.3121 1.9428 4.4428 7.1210 6.4657 5.2481 5.9729 1.6366 3.8056 2.2059 1.5212 3.6259 2.3326 1.6187 1.2456 2.6126 1.4510 1.2942 3.2278 1.8364 2.9391 2.5024 1.3313 3.2008 2.2703 2.1041 1.6474 1.5669 1.8928 2.9222 1.8991 1.2707 1.0544 2.0968 1.1456 1.8843 1.2567 1.1691 1.3207 2.2212 1.3252 1.5240 1.3550 1.3781 1.4149 1.4220 1.6171 1.4752 7.2014 1.4286 2.2918 1.1286 1.0944 1.0882 1.1020 1.0830 1.3131 1.6888 8.6119 6.3948 6.0339 1.0708 1.0702 1.0634 1.0608 1.0610 1.0636 1.0958 1.0921 1.0992 1.0947 1.0992 1.0992 1.0852 1.0896 1.0945 1.0987 1.0953 1.0683
irintensity: 0.8567 0.4877 0.4612 2.2632 0.9828 1.2320 2.0076 0.4406 2.9758 1.7435 3.8205 103.1419 47.6980 8.1022 1.5641 2.4551 1.6346 13.4044 3.1760 2.4539 3.2397 4.0077 47.8430 3.8249 0.2775 28.3236 5.1790 80.7710 24.8138 21.2955 0.9436 28.3936 1.6324 7.7038 0.8974 1.5408 5.5932 4.7403 2.2095 0.9833 2.4432 62.2349 2.0214 100.3775 32.3723 5.3642 38.3407 24.8766 52.4328 5.0582 5.1718 2.6960 0.1256 116.2105 6.0837 21.6214 0.4240 5.8966 70.2578 224.7206 4.0629 4.0697 19.9325 18.3001 1.7795 10.5230 25.2963 3.1036 2.1300 39.5008 17.5015 30.6272 6.4671 13.7204 13.6690 7.3837 9.0631 3.4232 119.1296 6.4206 4.1847 70.6331 209.4524 44.8375 32.5502 43.4420 53.0263 66.2674 50.5440 6.0585 34.3056 75.4716 4.9826 0.1639 15.9160 20.3694 21.5074 6.4208 12.8386
temp: 298.150 k
press: 1.00000 atm
elementType: 8 8 7 7 6 6 6 6 6 6 6 6 6 6 6 6 6 1 1 1 1 1 1 1 1 1 1 1 1 1 1 1 1 1 1
symmnumber: 1
zpe: 764123.3 jmol-1
zpe.correction: 0.291039 hartree
zpe.thermalcorrener: 0.307420 hartree
zpe.thermalcorrenthalpy: 0.308365 hartree
zpe.thermalcorrgfe: 0.244513 hartree
zpe.sumelectzpe: -764.787568 hartree
zpe.sumelectthermal: -764.771187 hartree
zpe.sumelectthermalent: -764.770243 hartree
zpe.sumelectthermalfe: -764.834094 hartree
dipole: -0.0435 2.2034 1.9456
dipole: 2.9398
quadrupole: -87.3572 -102.3292 -95.5909
quadrupole: -3.0026 1.6584 0.1836
quadrupole: 7.7352 -7.2367 -0.4985 -3.0026 1.6584 0.1836
hfenergy: -765.0786071 hartree
pointgroup: C01 [X(C13H18N2O2)]
dipole: -0.0924655 -0.5158623 -1.0310447 debye
polarizability: 204.6186976|17.5570031|121.1922157|-3.551061|-10.414109|154.2824852 unknown
InChI: InChI=1S/C13H18N2O2/c16-13(12-7-3-1-4-8-12)15(17)11-14-9-5-2-6-10-14/h1,3-4,7-8,17H,2,5-6,9-11H2
charge 0 multiplicity 1
35 atoms
O  -0.039921 -1.319961 -1.732522
O  0.630101 -0.686117 1.780246
N  -2.375538 -0.608793 0.268055
N  -0.093721 -1.416037 -0.270737
C  -2.860345 -0.145365 1.58598
C  -3.341583 -0.468476 -0.838864
C  -3.328191 1.324117 1.505525
C  -3.818686 0.995033 -0.965581
C  -4.377091 1.506459 0.383297
C  -1.471763 -1.736292 0.237537
C  0.827607 -0.715283 0.520423
C  2.068562 -0.111054 -0.08396
C  2.133476 0.505246 -1.362846
C  3.21662 -0.088249 0.754594
C  3.333223 1.115891 -1.792795
C  4.416893 0.503813 0.312654
C  4.479778 1.107607 -0.965951
H  -2.03296 -0.242881 2.3103
H  -3.715377 -0.773369 1.947353
H  -4.237156 -1.124756 -0.680319
H  -2.851094 -0.789625 -1.774977
H  -2.448774 1.964105 1.299382
H  -3.746683 1.630657 2.483762
H  -4.587528 1.065915 -1.759512
H  -2.958134 1.621864 -1.269759
H  -5.29393 0.935223 0.641171
H  -4.673277 2.569403 0.300013
H  -1.830432 -2.548239 -0.424674
H  -1.311488 -2.136644 1.252653
H  0.513635 -2.09913 -2.014528
H  1.249325 0.518969 -2.003721
H  3.138035 -0.527116 1.754607
H  3.370341 1.600273 -2.775064
H  5.297309 0.503891 0.964692
H  5.409566 1.575322 -1.309135
