program: Gaussian 09
title: 000038690
version: EM64L-G09RevD.01
frameworkgroup: C1[X(C7H8N2O4)]
method: RPBEPBE
basis: SDD
operation: Freq
keyword: #pfreq=noraman
keyword: PBEPBE/SDD
title: #p freq=noraman PBEPBE/SDD
converged: YES YES NO NO
title: Mulliken charges:
elementType: O O O O N N C C C C C C C H H H H H H H H
charge: -0.214456 -0.417316 -0.213349 -0.194470 -0.006130 0.051325 0.371147 -0.435745 -0.314548 0.276558 -0.301805 -0.297856 -0.322406 0.185178 0.233170 0.292154 0.294537 0.230614 0.243745 0.202091 0.337563
chargesum: 0.00000
title: Mulliken charges with hydrogens summed into heavy atoms:
elementType: O O O O N N C C C C C C C
charge: -0.214456 -0.079753 -0.213349 -0.194470 -0.006130 0.051325 0.371147 -0.017397 -0.022394 0.276558 -0.007267 -0.067242 0.123429
polarizability: 2.24881720e+02 9.54669434e+00 1.03615980e+02 -1.39388261e+01 1.15042979e+01 6.09125526e+01
1716.lowfreq: -3.9664 -0.0005 -0.0003 0.0006 3.4855 10.4222 31.6960 49.9270 75.6456
frequency: 31.5288 49.8970 75.6366 85.2755 96.7638 160.9024 199.9469 214.4737 294.8534 313.8855 330.3574 339.0905 390.3973 455.6915 507.5955 556.8954 567.1422 651.3648 684.2931 734.2097 760.3802 830.0590 845.4267 880.4431 912.9164 920.8227 937.9591 957.5807 1013.6072 1019.2859 1030.8726 1042.1154 1135.1571 1159.5131 1177.0633 1214.9430 1234.1860 1264.3268 1322.2381 1332.6096 1344.9757 1358.7669 1369.3509 1378.0181 1454.6747 1463.1283 1491.0257 1559.1304 1613.8218 2900.6624 2973.8300 2983.5233 3034.2376 3102.2632 3243.2722 3261.0627 3557.6076
redmass: 6.1455 9.2047 6.7114 4.3094 6.3573 2.8261 6.3218 4.9538 2.0234 3.0663 2.0878 4.3468 2.8265 7.7825 3.3870 5.6979 5.6655 4.1963 8.6491 12.1055 4.3302 1.2986 2.8775 2.1682 1.3848 6.1368 5.3673 1.7986 1.6228 1.7070 2.1997 2.2996 4.9944 1.8247 2.0341 1.8001 1.1494 6.2623 1.3287 1.2072 5.8914 2.6423 1.2371 2.3639 1.0845 1.1005 8.6522 6.7334 6.9879 1.0678 1.0684 1.0876 1.0914 1.0962 1.0949 1.1047 1.0663
irintensity: 1.0505 1.2329 7.4967 9.6505 3.0092 11.1440 1.5630 8.3174 50.2808 78.9725 88.7245 3.0488 6.8848 1.8212 20.4705 10.6418 1.4726 1.1324 10.1826 16.5328 11.5828 55.5612 12.9911 36.5921 0.5116 3.0514 3.3390 11.8555 35.7545 77.8653 16.2151 25.7786 38.7457 23.5478 45.0946 229.1379 10.9588 240.4375 2.3629 9.2988 59.4032 83.1909 5.6720 12.8083 16.5738 14.1714 99.7487 2.2061 11.7180 103.6703 106.7562 35.4134 37.1120 16.1889 0.2747 4.8448 6.7240
temp: 298.150 k
press: 1.00000 atm
elementType: 8 8 8 8 7 7 6 6 6 6 6 6 6 1 1 1 1 1 1 1 1
symmnumber: 1
zpe: 393697.4 jmol-1
zpe.correction: 0.149951 hartree
zpe.thermalcorrener: 0.162395 hartree
zpe.thermalcorrenthalpy: 0.163339 hartree
zpe.thermalcorrgfe: 0.109353 hartree
zpe.sumelectzpe: -680.819530 hartree
zpe.sumelectthermal: -680.807086 hartree
zpe.sumelectthermalent: -680.806142 hartree
zpe.sumelectthermalfe: -680.860128 hartree
dipole: 6.4877 1.7624 -1.6339
dipole: 6.9185
quadrupole: -80.9711 -71.6282 -77.8516
quadrupole: -12.7872 -8.4414 3.0630
quadrupole: -4.1542 5.1888 -1.0346 -12.7872 -8.4414 3.0630
hfenergy: -680.969481 hartree
pointgroup: C01 [X(C7H8N2O4)]
dipole: -2.4760193 0.2578588 -1.1008056 debye
dipolederiv: 0.0445248 0.0164578 0.0382697 -0.0341292 -0.4039038 -0.2334758 0.0139922 -0.2209697 -0.2286475 -0.5587267 -0.0924271 0.0046675 -0.2184275 -0.1255018 0.0406924 0.3582226 0.0582083 -0.8088686 -1.0386145 0.1868921 -0.0891601 0.3329362 -0.4725826 -0.0718635 -0.0115276 -0.1069778 -0.3155201 -0.5135717 -0.0336661 -0.1054199 -0.2786936 -0.5805852 -0.3183624 -0.2850133 -0.2613559 -0.473813 -0.2793204 0.090113 -0.0497377 -0.0844688 -0.3359461 0.0485449 -0.0459824 0.0207583 -0.4160633 2.0956183 -0.0440283 0.4911511 0.201704 0.8603114 0.498084 0.7200516 0.4423488 0.7071401 0.1271727 0.0284667 0.0015006 -0.1232311 0.1543728 0.0511052 -0.0816077 0.0691305 0.0912359 -0.0265566 -0.115617 0.1481488 -0.4272601 0.3063696 0.0953611 0.3203123 0.0743406 0.082744 -0.3711473 0.0489284 -0.0153953 0.3520541 -0.0942337 0.1305006 0.184061 0.050722 -0.0660998 -0.9631577 -0.1163127 -0.3429578 -0.3889612 0.1239543 -0.087232 -0.591748 -0.0057715 -0.0832974 0.3448755 -0.0359649 0.1034182 0.1145294 -0.0025782 0.1105323 0.2239541 0.0639578 -0.0062483 0.3962814 -0.1507081 0.07843 -0.3393065 0.3189268 0.1140314 -0.1873656 0.1992577 0.1762204 0.4441973 0.0245593 0.0034761 0.4611166 0.1909271 -0.0003852 -0.3583596 -0.0069765 0.7114721 -0.0863018 -0.0264378 -0.0091758 0.1672842 -0.2096153 -0.061883 0.06261 -0.1524263 0.0255199 -0.0353962 0.0295246 -0.0666612 0.119605 0.0742395 -0.002489 -0.1285651 0.0373488 -0.0872645 0.0895718 -0.0321476 -0.0533406 -0.0244447 0.1328013 -0.0441175 -0.0473738 -0.0469813 0.1438249 0.0869965 0.0507485 0.0026729 0.0327152 0.1338877 -0.0337903 -0.0125051 -0.028737 0.1752155 0.0182885 0.0397012 -0.023465 0.0535342 -0.0494086 -0.1405621 -0.002884 -0.1469036 0.0650174 0.1465548 0.0200842 0.0022023 -0.0408023 -0.0820506 -0.0489735 -0.0365424 -0.0360957 0.0205606 -0.3058783 0.0710143 -0.0539394 0.0550329 0.057656 0.0360627 0.0467201 0.0059003 -0.0149394 0.3845895 0.0408196 -0.0646845 0.0692131 0.0029594 -0.0817803 -0.1404492 -0.0087778 0.301811 unknown
polarizability: 220.7759612|-15.632293|88.9997266|26.7326619|21.5790261|79.6345653 unknown
InChI: InChI=1S/C7H8N2O4/c10-4-3-8-5-6-1-2-7(13-6)9(11)12/h1-2,5,10H,3-4H2
charge 0 multiplicity 1
21 atoms
O  0.963122 0.541835 0.425925
O  -4.145081 0.031115 1.588802
O  4.317986 -0.705357 0.584015
O  3.354385 1.135029 1.575247
N  -2.402877 0.185908 -0.901299
N  3.313293 0.08262 0.826838
C  -0.094026 -0.041323 -0.307424
C  -3.697041 0.86032 -0.735025
C  0.36829 -1.188327 -0.96689
C  2.073339 -0.272543 0.197189
C  1.754049 -1.336353 -0.645196
C  -1.37805 0.636601 -0.226139
C  -4.610302 0.024915 0.2002
H  -3.613331 1.89623 -0.326711
H  -4.183169 0.912804 -1.727698
H  -0.244245 -1.826986 -1.598115
H  2.443586 -2.109847 -0.972545
H  -1.406297 1.530557 0.429601
H  -4.583116 -1.03269 -0.10529
H  -5.651788 0.400345 0.116761
H  -4.261625 0.937746 1.971354
