program: Gaussian 09
title: 000038683
version: EM64L-G09RevD.01
frameworkgroup: C1[X(C10H10ClN3O)]
method: RPBEPBE
basis: SDD
operation: Freq
keyword: #p
keyword: freq=noraman
keyword: PBEPBE/SDD
title: #p freq=noraman PBEPBE/SDD
converged: NO YES NO NO
title: Mulliken charges:
elementType: Cl O N N N C C C C C C C C C C H H H H H H H H H H
charge: -0.066171 -0.215585 -0.240446 -0.196657 -0.377961 -0.485190 0.220211 0.149893 0.414353 -0.644000 -0.304873 -0.349303 -0.224766 -0.226455 -0.110879 0.270435 0.270310 0.246531 0.279300 0.246666 0.334196 0.246646 0.252954 0.253085 0.257709
chargesum: 0.00000
title: Mulliken charges with hydrogens summed into heavy atoms:
elementType: Cl O N N N C C C C C C C C C C
charge: -0.066171 -0.215585 -0.240446 -0.196657 -0.120251 0.055554 0.220211 0.149893 0.414353 0.128496 0.029323 -0.102657 0.028188 0.026630 -0.110879
polarizability: 2.25986024e+02 1.43388675e+00 1.47340538e+02 1.55176511e-02 -1.27718448e-02 6.27136594e+01
1716.lowfreq: -11.2352 -3.5788 -0.0025 -0.0024 -0.0022 2.8492 43.1056 60.9929 110.2066
frequency: 43.0320 60.9927 110.2050 116.5749 143.3376 147.3024 215.3227 225.2834 241.8386 250.0013 293.2945 342.5601 371.6062 382.2647 414.5719 464.4710 505.0322 573.0498 574.7398 627.1723 639.4551 671.7938 679.3666 696.3438 716.4323 740.8221 800.9500 803.7766 848.2811 931.7162 953.3389 992.8148 995.9337 1005.7010 1010.4652 1077.8893 1110.3150 1112.2664 1127.4568 1150.9846 1178.9955 1183.6863 1195.0977 1249.3266 1290.5336 1305.4667 1364.5326 1372.7250 1382.3498 1414.1067 1435.4827 1463.9179 1477.9719 1483.2568 1488.2809 1577.3033 1609.2523 1646.4039 1685.5446 2985.2536 2990.4834 3043.3885 3071.9820 3108.8169 3151.9444 3158.4201 3172.0900 3174.8446 3410.7961
redmass: 6.8067 4.1190 4.8893 7.3784 1.4124 2.3665 4.9368 2.8911 9.7635 5.8344 3.9167 6.1899 5.2387 5.3326 3.0671 8.4242 2.7724 6.8083 3.3000 7.1398 3.8242 8.3526 7.6417 2.1522 1.4828 5.9497 3.9947 1.4359 1.3707 1.3494 2.5896 4.4465 1.2928 1.8395 1.9268 2.5238 3.1827 1.7706 1.3150 2.1557 1.0883 4.1266 1.1361 3.0337 1.6894 1.2900 5.1798 6.1560 3.1538 3.2708 1.3494 1.1147 1.0425 1.1060 2.5810 7.7678 6.0090 7.4391 9.4097 1.0341 1.0582 1.1043 1.1028 1.0993 1.0876 1.0899 1.0963 1.0974 1.0770
irintensity: 0.0041 0.6443 2.7254 0.3051 1.8188 4.7141 0.6565 9.5223 0.2686 0.3898 1.7998 6.1526 21.1435 13.6019 0.0012 24.7304 15.5375 22.8319 1.0328 0.7544 6.0680 2.1583 8.7767 25.1264 72.7723 19.9826 21.6373 32.7107 54.7440 0.0548 47.4910 16.4257 5.0050 0.1302 99.4754 24.6351 47.6202 10.8297 0.0097 177.6074 1.1033 0.1543 1.2068 100.8111 64.8424 13.0462 36.7807 53.0792 142.0843 5.4699 170.1274 57.2161 20.2545 56.9262 330.6217 0.4406 46.9096 480.8600 224.9288 33.7086 21.4048 7.0001 20.9013 0.4010 8.8765 9.8239 14.8497 10.6928 13.6709
temp: 298.150 k
press: 1.00000 atm
elementType: 17 8 7 7 7 6 6 6 6 6 6 6 6 6 6 1 1 1 1 1 1 1 1 1 1
symmnumber: 1
zpe: 491910.5 jmol-1
zpe.correction: 0.187359 hartree
zpe.thermalcorrener: 0.200786 hartree
zpe.thermalcorrenthalpy: 0.201730 hartree
zpe.thermalcorrgfe: 0.146636 hartree
zpe.sumelectzpe: -1085.533779 hartree
zpe.sumelectthermal: -1085.520352 hartree
zpe.sumelectthermalent: -1085.519408 hartree
zpe.sumelectthermalfe: -1085.574503 hartree
dipole: 2.9710 0.8153 0.0011
dipole: 3.0808
quadrupole: -104.6914 -90.1453 -96.7240
quadrupole: 16.1723 0.0071 -0.0300
quadrupole: -7.5045 7.0416 0.4629 16.1723 0.0071 -0.0300
hfenergy: -1085.7211383 hartree
pointgroup: C01 [X(C10H10Cl1N3O1)]
dipole: 1.1668961 -0.3279116 0.0000993 debye
dipolederiv: -0.983065 0.0104504 0.0003716 -0.0048572 -0.1288694 0.0001281 0.0004807 0.0001182 -0.0744576 -1.0452996 -0.4982818 -0.0000201 -0.4380148 -0.8646451 0.0001939 -0.0006332 -0.0003142 -0.3499547 -1.8879408 0.2757699 -0.0003922 0.4972897 -0.7057621 0.0008306 -0.0009599 0.000774 -0.1868266 -1.2200035 -0.1554395 -0.0005257 -0.6445258 -1.2587004 0.0004703 -0.0004273 0.001049 -0.1567346 -0.3628673 -0.2592303 0.0004905 0.2778494 -1.2435962 0.0005369 0.0004338 0.0000593 -0.4981933 -0.2149001 0.2135488 -0.0009537 0.4189385 0.3531486 -0.0000932 -0.0018002 0.0000263 0.2928827 1.7459001 0.1449923 0.0008502 -0.5748451 1.5903509 -0.000927 0.0023401 -0.0009959 0.1585686 1.0892965 0.3797906 0.0005465 0.6964175 1.6435217 -0.0009507 0.0007137 -0.0007392 0.1769153 1.6117319 -0.138802 0.0000039 0.0487754 -0.0520017 0.0001013 -0.0001427 0.0000394 0.0846373 0.3201382 -0.2323214 -0.0000301 -0.2639521 0.1672092 -0.0001434 -0.0000509 -0.0003226 0.2313278 -0.3820549 0.0442865 -0.0002313 -0.1528872 -0.0335539 -0.0001948 0.0001192 -0.0000647 -0.1512052 -0.2279874 -0.0259642 -0.0000917 0.2138028 -0.0018715 -0.0005691 -0.000457 -0.0006377 -0.2017863 -0.1481474 0.0084131 0.0000524 0.0384715 0.08494 -0.0004388 -0.0000472 -0.0004095 -0.1058209 -0.2311604 0.029137 -0.0000227 -0.0946312 0.067294 -0.0003942 0.0003642 -0.0004235 -0.1077279 1.2349219 -0.0020728 -0.0006748 0.0693921 0.004501 -0.0002028 -0.0008664 -0.0001556 -0.0815146 0.0732389 0.0324358 0.0347386 -0.0490108 -0.0147942 -0.0522828 0.026309 -0.0879295 -0.0082394 0.0732784 0.0319588 -0.0346024 -0.0492936 -0.0146073 0.0523177 -0.0257896 0.0881689 -0.0090429 0.0782756 0.0194643 0.0421291 0.1029938 -0.0066484 0.0931493 -0.0136131 0.0968653 -0.0462688 0.0405447 -0.0147812 -0.0002608 -0.1468574 0.0880245 -0.0004702 -0.0000802 -0.0001317 0.1389346 0.0779914 0.0201852 -0.0413493 0.1034827 -0.0065664 -0.0926942 0.0144544 -0.0968768 -0.046619 0.2471257 0.0245251 -0.0000236 -0.0301306 0.0810707 0.0002179 -0.0001186 0.000178 0.173726 0.0321872 -0.0996972 0.0003586 -0.1070194 -0.027373 0.0005262 0.0002952 0.0005769 0.1657624 0.0459233 -0.0628376 0.0001997 -0.0735327 -0.0066696 0.0003944 0.0002573 0.0003517 0.1596496 0.0477506 0.0657189 -0.0001095 0.0700244 -0.0085598 0.0003932 -0.0001306 0.0003802 0.16396 -0.0148782 0.1887515 -0.0004531 0.0921202 0.2941585 0.0001012 -0.0006505 0.0004137 0.2780275 unknown
polarizability: 225.965542|-1.9148259|147.3608198|-0.0017936|-0.1312035|62.7138594 unknown
InChI: InChI=1S/C10H10ClN3O/c1-13-9(15)6-14(10(13)12)8-4-2-7(11)3-5-8/h2-5,12H,6H2,1H3
charge 0 multiplicity 1
25 atoms
Cl -5.411911 0.024414 0.00091
O  3.850013 1.788195 0.000112
N  0.657815 0.128807 -0.001904
N  2.877022 -0.373723 0.000917
N  1.236066 -2.219229 0.000792
C  1.374726 1.417989 -0.003043
C  1.560277 -0.954268 0.000113
C  2.853352 1.024203 -0.000784
C  -0.763032 0.071843 -0.00151
C  4.10614 -1.164829 0.003508
C  -1.470372 -1.163921 0.00144
C  -1.501279 1.28971 -0.004128
C  -2.879336 -1.17335 0.002213
C  -2.911103 1.276719 -0.003364
C  -3.587017 0.043314 -0.000107
H  1.145944 2.026146 0.892419
H  1.148499 2.022892 -0.901472
H  4.168408 -1.8003 0.905346
H  4.949573 -0.455493 0.005841
H  4.172862 -1.799527 -0.898563
H  -0.899335 -2.094688 0.002742
H  -0.995064 2.259175 -0.006929
H  -3.416689 -2.12645 0.00455
H  -3.469803 2.217131 -0.005362
H  2.044545 -2.864562 0.002464
