program: Gaussian 09
title: 000038625
version: EM64L-G09RevD.01
frameworkgroup: C1[X(C4H7ClOS)]
method: RPBEPBE
basis: SDD
operation: Freq
keyword: #p
keyword: freq=noraman
keyword: PBEPBE/SDD
title: #p freq=noraman PBEPBE/SDD
converged: YES YES NO NO
title: Mulliken charges:
elementType: Cl S O C C C C H H H H H H H
charge: -0.055831 0.632518 -0.626169 -0.547554 -0.542051 -0.360039 -0.431869 0.261884 0.304054 0.268382 0.308415 0.260524 0.239515 0.288223
chargesum: 0.00000
title: Mulliken charges with hydrogens summed into heavy atoms:
elementType: Cl S O C C C C
charge: -0.055831 0.632518 -0.626169 0.018383 0.034746 -0.099515 0.095868
polarizability: 1.11555943e+02 1.54295856e+00 6.51360443e+01 -8.65369507e+00 4.31114757e+00 5.96047952e+01
1716.lowfreq: -13.8781 -0.0032 -0.0030 -0.0017 2.4174 6.4495 46.4568 84.0816 94.5225
frequency: 46.3174 83.9696 94.4916 149.5386 202.0606 217.0480 258.4237 330.9178 458.1389 498.5765 553.8922 616.1053 677.6647 776.9221 797.1287 925.2703 946.1826 956.8376 997.8875 1066.3150 1091.5270 1193.5277 1209.5348 1262.9131 1281.5109 1360.2435 1426.2055 1465.7911 1603.3664 3049.9438 3057.5694 3065.6188 3137.8824 3159.9417 3166.4141 3201.3845
redmass: 3.6469 2.5808 5.6614 2.6744 7.4613 4.3625 3.6057 5.1059 3.8136 6.2555 4.3475 1.6923 5.6262 1.9439 2.2613 1.1572 1.2679 1.3167 1.2185 4.3460 1.0610 1.2410 1.2143 1.2040 1.1773 1.1457 1.1070 1.0950 4.8133 1.0567 1.0613 1.0559 1.1102 1.1120 1.0985 1.1138
irintensity: 1.1714 3.2743 8.4995 2.1751 0.8555 14.5958 0.6468 15.6436 3.5817 3.1427 11.4299 27.7743 50.3593 18.6148 26.1369 5.9723 0.6757 5.1229 91.4631 19.5815 1.9373 9.6662 15.1303 0.7177 10.9960 28.1532 7.7179 9.5247 17.7393 4.0781 4.5180 10.1150 1.1844 6.2661 3.8098 1.4621
temp: 298.150 k
press: 1.00000 atm
elementType: 17 16 8 6 6 6 6 1 1 1 1 1 1 1
symmnumber: 1
zpe: 265493.6 jmol-1
zpe.correction: 0.101121 hartree
zpe.thermalcorrener: 0.110320 hartree
zpe.thermalcorrenthalpy: 0.111264 hartree
zpe.thermalcorrgfe: 0.065549 hartree
zpe.sumelectzpe: -1089.293651 hartree
zpe.sumelectthermal: -1089.284452 hartree
zpe.sumelectthermalent: -1089.283508 hartree
zpe.sumelectthermalfe: -1089.329223 hartree
dipole: -1.5282 -2.7350 -2.4246
dipole: 3.9616
quadrupole: -60.6156 -58.7684 -55.1738
quadrupole: 8.9774 -0.5742 -1.6878
quadrupole: -2.4297 -0.5825 3.0121 8.9774 -0.5742 -1.6878
hfenergy: -1089.394772 hartree
pointgroup: C01 [X(C4H7Cl1O1S1)]
dipole: -0.5387414 1.3723308 0.5057324 debye
dipolederiv: -0.7319563 -0.0536393 0.1599121 -0.0490955 -0.1791065 0.0433634 0.2815975 0.0405583 -0.2497714 0.3896337 0.1074911 -0.0910231 0.1000459 0.7025132 -0.3315235 -0.0722604 -0.0279927 0.2963185 -0.4691227 -0.0089775 0.0649056 -0.0376463 -0.6090361 0.2721072 -0.0207798 -0.1540364 -0.343272 -0.0550305 -0.015539 -0.048028 0.1176972 -0.085854 0.0920594 -0.0069371 0.091212 -0.0138892 0.7192626 0.1327441 -0.2124556 -0.1641349 0.1040101 -0.0529468 -0.1989856 -0.0819868 0.3034338 0.1018557 -0.178478 0.1966256 -0.1487537 -0.0632469 0.0567486 0.2199387 0.0402381 -0.191804 -0.3120201 -0.0221019 0.0667451 0.0325482 -0.0931808 0.0599964 0.0121816 0.0640414 -0.2065143 0.0196866 -0.0473403 0.0086805 -0.0121387 -0.0496365 -0.0762098 0.0305891 -0.0453649 0.0452813 0.0035988 -0.0137621 -0.0127648 0.0066629 0.0561647 0.020616 -0.0375287 0.0405569 -0.0168595 -0.013343 -0.0211071 0.0183791 -0.0038385 0.0852773 0.0387832 -0.0279793 0.0646084 -0.0886593 0.0579837 -0.0917004 0.0259553 0.0001537 0.0137882 -0.0344248 0.0419556 -0.0186239 0.051197 0.0449724 0.0718134 -0.0770721 0.1005296 -0.0498552 -0.056265 -0.1190191 -0.0280819 0.1161881 0.0336173 0.1096447 -0.0867032 0.0680741 0.1065173 0.014663 -0.1000853 0.0316633 0.148378 0.2108619 0.0309523 -0.0131565 -0.0101038 0.0616452 -0.0469673 -0.0026873 -0.0167917 0.149973 unknown
polarizability: 112.8164235|2.6581416|67.4834151|-0.3869281|0.3356301|55.9969439 unknown
InChI: InChI=1S/C4H7ClOS/c1-2-7(6)4-3-5/h2H,1,3-4H2
charge 0 multiplicity 1
14 atoms
Cl 3.429077 0.267581 -0.872715
S  -0.687726 -0.23095 1.039048
O  -0.931237 -1.63941 0.163454
C  0.85243 0.596198 0.111587
C  1.976077 -0.421437 0.132215
C  -1.992085 0.97447 0.331922
C  -2.842373 0.458943 -0.573199
H  1.081021 1.525753 0.656982
H  0.487232 0.800636 -0.906119
H  2.380882 -0.610264 1.137291
H  1.681347 -1.360189 -0.358998
H  -1.976119 1.976582 0.77074
H  -3.653155 1.052628 -1.008374
H  -2.716071 -0.591239 -0.881333
