program: Gaussian 09
title: 000038566
version: EM64L-G09RevD.01
frameworkgroup: C1[X(C11H20O)]
method: RPBEPBE
basis: SDD
operation: Freq
keyword: #pfreq=noraman
keyword: PBEPBE/SDD
title: #p freq=noraman PBEPBE/SDD
converged: YES YES NO NO
title: Mulliken charges:
elementType: O C C C C C C C C C C C H H H H H H H H H H H H H H H H H H H H
charge: -0.330802 -0.417299 -0.408646 -0.460525 -0.481375 0.151815 0.249744 0.314624 -0.822867 -0.718590 -0.698706 -0.689245 0.201355 0.206468 0.204386 0.199713 0.192988 0.227548 0.209407 0.206745 0.215684 0.211236 0.258584 0.235032 0.215024 0.224446 0.230716 0.221528 0.196387 0.223282 0.203011 0.228331
chargesum: 0.00000
title: Mulliken charges with hydrogens summed into heavy atoms:
elementType: O C C C C C C C C C C C
charge: -0.330802 -0.009476 -0.004546 -0.039989 -0.065223 0.151815 0.249744 0.314624 -0.137363 -0.044087 -0.050074 -0.034621
polarizability: 1.45530820e+02 8.34018894e+00 1.25455191e+02 1.62883144e+00 1.19807986e+00 9.61213640e+01
1716.lowfreq: -14.9105 -14.3212 -0.0006 -0.0006 -0.0005 3.3877 31.3112 55.7006 95.4537
frequency: 29.6203 55.5928 95.4495 132.1515 136.7077 167.1518 178.0062 222.6257 231.1569 253.3844 267.5557 300.8777 318.2614 343.1323 367.2148 379.7434 421.6599 446.1419 457.7986 478.1609 546.6201 634.3023 662.0938 729.4609 804.3922 825.0324 867.0408 882.5564 904.5985 907.0209 915.8209 931.6118 943.9218 1008.3801 1020.7932 1021.2568 1025.2718 1077.4608 1088.1528 1102.4590 1129.7092 1143.5520 1166.0137 1182.2385 1221.9683 1241.6619 1242.9333 1261.4967 1266.6896 1329.5105 1336.5517 1343.3016 1348.5912 1372.9779 1374.6091 1381.8247 1397.2293 1444.5489 1454.2317 1455.9434 1459.9815 1461.4858 1464.6572 1467.6794 1469.9360 1473.5350 1474.5198 1478.3665 1491.2652 1688.6102 2938.3306 2947.3517 2954.6728 2971.6460 2979.0560 2982.9333 2984.3143 2990.3724 2992.1567 3018.9547 3022.3231 3035.0015 3045.3061 3076.5394 3080.2978 3087.1043 3091.5168 3095.2811 3100.0156 3103.1023
redmass: 2.7996 3.0393 2.8563 2.1781 1.0375 1.0655 2.6234 1.0785 1.2002 2.2449 2.3319 1.7393 2.4762 2.5641 2.6001 2.4910 2.8969 2.7053 2.7732 3.4089 2.6143 2.9529 4.4255 3.9048 2.6651 1.4864 2.4106 2.3108 1.5564 1.5175 1.6302 2.2254 1.2025 1.5847 1.3984 1.3747 1.4011 2.0018 1.9156 3.7736 1.8916 1.3720 1.6370 2.2100 2.1343 1.8258 1.8111 2.2264 1.5164 1.4191 1.7228 1.4907 1.6591 1.2364 1.2363 1.2608 1.2124 1.0537 1.0948 1.0628 1.0619 1.0526 1.0577 1.0814 1.0602 1.0812 1.0538 1.0726 1.0528 6.9269 1.0625 1.0653 1.0400 1.0687 1.0621 1.0355 1.0351 1.0363 1.0879 1.0962 1.0926 1.0992 1.1042 1.0986 1.0993 1.1005 1.0991 1.0997 1.0998 1.0955
irintensity: 0.1359 2.0534 0.4511 0.0860 0.1943 0.0311 1.3471 0.2620 0.3017 0.6982 0.2268 0.6407 7.1392 5.2197 1.3760 0.6493 3.0166 0.2338 0.1523 6.6181 3.2962 0.6984 2.2955 7.7244 4.6510 9.9323 6.4238 21.7391 0.9947 2.2037 2.1622 17.0094 0.0298 7.4437 1.6676 1.5640 0.7445 25.1130 15.2714 169.8369 18.4845 18.1693 20.3685 38.3695 8.5336 11.9695 17.9770 18.1030 8.3237 11.8113 3.9378 7.4654 1.1192 28.4783 33.7116 18.5159 20.2904 2.0228 1.5516 4.7231 8.4949 0.9882 2.5482 13.8811 6.5999 5.3766 14.9596 1.9229 19.2705 16.4401 46.8763 52.8579 64.0597 18.3051 41.0493 21.1420 21.1117 25.7773 54.2668 33.6303 26.6438 66.2217 72.6466 4.5676 23.2333 12.2493 67.6431 42.9562 38.9322 16.1324
temp: 298.150 k
press: 1.00000 atm
elementType: 8 6 6 6 6 6 6 6 6 6 6 6 1 1 1 1 1 1 1 1 1 1 1 1 1 1 1 1 1 1 1 1
symmnumber: 1
zpe: 745886.8 jmol-1
zpe.correction: 0.284093 hartree
zpe.thermalcorrener: 0.298405 hartree
zpe.thermalcorrenthalpy: 0.299349 hartree
zpe.thermalcorrgfe: 0.243607 hartree
zpe.sumelectzpe: -505.400642 hartree
zpe.sumelectthermal: -505.386330 hartree
zpe.sumelectthermalent: -505.385386 hartree
zpe.sumelectthermalfe: -505.441127 hartree
dipole: -0.0620 -0.6771 1.3728
dipole: 1.5319
quadrupole: -70.6639 -74.2120 -77.3050
quadrupole: 0.8914 -1.7480 0.6531
quadrupole: 3.3964 -0.1517 -3.2447 0.8914 -1.7480 0.6531
hfenergy: -505.6847349 hartree
pointgroup: C01 [X(C11H20O1)]
dipole: 0.0080377 -0.2168309 0.5623038 debye
polarizability: 144.7764191|9.2021091|126.1759882|-1.0931416|-1.8328469|96.1549668 unknown
InChI: InChI=1S/C11H20O/c1-9-7-5-6-8-10(9)12-11(2,3)4/h5-8H2,1-4H3
charge 0 multiplicity 1
32 atoms
O  -1.020833 0.12248 -0.684342
C  2.408657 -1.502237 -0.262069
C  3.067029 -0.391576 0.583932
C  0.870144 -1.437632 -0.125306
C  2.62049 0.999284 0.080225
C  0.341802 -0.016804 -0.286907
C  1.125238 1.100083 -0.206581
C  -2.139842 -0.206293 0.281985
C  0.589891 2.49712 -0.442975
C  -1.787945 0.270523 1.705366
C  -3.323288 0.591686 -0.298635
C  -2.444828 -1.722527 0.242006
H  2.773287 -2.501218 0.045527
H  2.689346 -1.364976 -1.325359
H  4.170402 -0.472323 0.547056
H  2.767033 -0.517503 1.64383
H  0.575238 -1.849591 0.86379
H  0.386316 -2.078411 -0.887651
H  3.180457 1.260134 -0.844741
H  2.896246 1.777457 0.822138
H  1.182694 3.01564 -1.223349
H  0.668579 3.115684 0.474574
H  -0.462893 2.470857 -0.764667
H  -1.559047 1.350478 1.708553
H  -2.643328 0.091412 2.382203
H  -0.912384 -0.268505 2.108581
H  -3.499722 0.295214 -1.347284
H  -3.104143 1.673413 -0.279896
H  -4.244561 0.404543 0.282672
H  -1.637914 -2.316857 0.702422
H  -3.381628 -1.937634 0.789778
H  -2.570194 -2.05202 -0.804276
