program: Gaussian 09
title: 000038668
version: EM64L-G09RevD.01
frameworkgroup: C1[X(C17H14ClFN2O3)]
method: RPBEPBE
basis: SDD
operation: Freq
keyword: #p
keyword: freq=noraman
keyword: PBEPBE/SDD
title: #p freq=noraman PBEPBE/SDD
converged: YES YES NO NO
title: Mulliken charges:
elementType: Cl F O O O N N C C C C C C C C C C C C C C C C C H H H H H H H H H H H H H H
charge: -0.040782 -0.175399 -0.402535 -0.252575 -0.445614 -0.225319 0.034790 0.269141 0.258471 -0.366682 -0.032875 0.114015 -0.293553 -0.340804 -0.314600 0.173977 -0.334519 -0.239806 -0.139306 0.171102 -0.315212 -0.371825 -0.240772 -0.198913 0.210628 0.284339 0.268037 0.251786 0.284229 0.222634 0.212152 0.263306 0.261793 0.371283 0.257447 0.230011 0.235896 0.356053
chargesum: 0.00000
title: Mulliken charges with hydrogens summed into heavy atoms:
elementType: Cl F O O O N N C C C C C C C C C C C C C C C C C
charge: -0.040782 -0.175399 -0.031252 -0.252575 -0.089561 -0.225319 0.034790 0.269141 0.258471 0.128284 -0.032875 0.114015 -0.025516 -0.089017 -0.030371 0.173977 0.100266 0.023501 -0.139306 0.171102 -0.053419 -0.114378 -0.010761 0.036984
polarizability: 2.53588975e+02 -9.44241855e+00 2.39144640e+02 -5.08977429e+00 1.22167395e+01 1.69599397e+02
1716.lowfreq: -5.7593 -3.6424 0.0014 0.0017 0.0017 4.9744 21.0493 36.5546 42.1994
frequency: 21.0015 36.4903 42.1596 50.2521 60.7211 77.4403 97.2802 104.4629 137.7421 149.7256 165.6735 182.7024 189.9610 213.7085 232.8734 256.2648 281.1190 298.6163 301.4621 319.6433 347.5325 371.3461 385.2132 405.7624 412.4238 426.1994 436.6891 471.6884 485.2896 502.0229 513.0075 530.9407 537.4020 590.8283 608.0998 629.9104 667.5832 680.2511 691.4966 734.8404 754.0109 768.0842 778.6539 785.3205 807.9142 820.3501 846.5998 865.0071 877.8831 892.4497 916.1649 929.5224 944.8578 950.6402 958.0077 984.1139 1016.9729 1033.4207 1042.4544 1071.0795 1085.9926 1094.7161 1099.3460 1129.3221 1165.7235 1171.5885 1176.0857 1195.4499 1197.7203 1221.1327 1249.4560 1263.5853 1267.3719 1274.4876 1286.7927 1301.6292 1328.2517 1369.0633 1372.4312 1377.4916 1387.8783 1400.0826 1407.9973 1431.2661 1463.8997 1474.2940 1476.8952 1481.5783 1549.3141 1574.7541 1584.5143 1592.2763 1612.3499 1616.3485 2956.7427 2990.3194 2997.1653 3010.3141 3084.3912 3134.5723 3146.9013 3150.3070 3162.9438 3165.0336 3175.7959 3178.9310 3490.7867 3585.7783
redmass: 7.0842 6.2049 5.6430 7.5457 5.7673 7.6265 4.7088 8.1662 6.0973 5.8477 1.6423 5.8292 2.0508 5.7255 3.0601 6.7383 4.0510 6.3225 3.6693 4.5530 3.6118 4.4830 8.0483 4.9632 2.6175 3.3841 4.1040 3.9607 5.4942 4.1630 5.1481 4.9304 5.9457 3.2770 6.1166 6.5710 5.6755 6.6796 5.7673 4.5187 3.3801 1.4919 5.9813 4.5173 6.9249 1.5032 2.2051 1.4664 3.9842 1.5544 4.0308 3.1775 1.9987 1.3709 2.7812 1.3332 3.9398 2.1856 3.4393 3.0910 2.1168 2.6001 2.0689 1.7462 1.5629 1.1800 1.1757 1.4434 3.0161 1.4093 1.7067 1.7145 2.1404 1.3244 1.6954 1.9593 2.0171 1.7250 7.4585 8.0104 1.4708 1.8668 1.5851 2.3407 2.5638 1.1219 1.0812 2.7906 8.3797 8.6881 7.6146 7.2051 9.0010 7.2621 1.0556 1.0832 1.0680 1.1049 1.0965 1.0865 1.0911 1.0887 1.0957 1.0925 1.0969 1.0989 1.0644 1.0670
irintensity: 0.8880 2.9696 0.3856 1.2299 0.7763 1.6858 13.4067 3.9849 6.8864 0.4846 101.6060 7.7097 27.4626 2.0195 29.8909 1.4491 7.2224 15.5849 8.8365 15.1976 21.8245 2.2466 10.3940 7.9147 62.4809 21.0984 3.4245 8.2914 7.8802 32.3533 3.8362 1.3112 6.7869 4.2222 1.7531 6.8620 25.1951 2.2182 4.6278 5.0349 13.4632 58.7594 22.0305 22.6748 19.8495 29.6267 42.6945 1.7024 11.6356 12.1373 6.7505 3.4003 25.5485 2.5278 44.6823 0.2331 34.8389 2.4354 72.6379 254.9598 41.6915 0.1517 12.1467 14.5361 3.0393 0.7439 32.9614 15.4741 38.0357 23.4497 26.0696 20.1009 51.9014 14.0290 35.7315 22.0082 39.3990 6.6928 24.4742 3.9368 81.3652 10.4567 7.0300 18.3967 92.9698 64.8810 10.0236 43.8875 42.1283 20.5391 22.4473 50.0134 349.8498 18.1649 44.1629 11.3808 41.2370 66.5202 5.3511 1.1059 6.1486 5.2430 16.0379 0.2183 3.2686 10.5470 27.9993 7.1818
temp: 298.150 k
press: 1.00000 atm
elementType: 17 9 8 8 8 7 7 6 6 6 6 6 6 6 6 6 6 6 6 6 6 6 6 6 1 1 1 1 1 1 1 1 1 1 1 1 1 1
symmnumber: 1
zpe: 727343.9 jmol-1
zpe.correction: 0.277031 hartree
zpe.thermalcorrener: 0.298623 hartree
zpe.thermalcorrenthalpy: 0.299567 hartree
zpe.thermalcorrgfe: 0.225108 hartree
zpe.sumelectzpe: -1549.550304 hartree
zpe.sumelectthermal: -1549.528712 hartree
zpe.sumelectthermalent: -1549.527768 hartree
zpe.sumelectthermalfe: -1549.602226 hartree
dipole: 1.7026 4.9367 6.8273
dipole: 8.5954
quadrupole: -123.1532 -163.8733 -138.1402
quadrupole: 12.0546 2.6619 -6.0467
quadrupole: 18.5690 -22.1511 3.5820 12.0546 2.6619 -6.0467
hfenergy: -1549.8273344 hartree
pointgroup: C01 [X(C17H14Cl1F1N2O3)]
dipole: 0.8299466 -2.1757735 -2.4521572 debye
polarizability: 252.0831343|10.7579501|242.4945453|3.6955921|4.4702197|167.7553329 unknown
InChI: InChI=1S/C17H14ClFN2O3/c18-10-5-6-14-12(9-10)15(11-3-1-2-4-13(11)19)20-16(23)17(24)21(14)7-8-22/h1-6,9,16,22-23H,7-8H2
charge 0 multiplicity 1
38 atoms
Cl -0.153398 -4.70652 1.461665
F  -3.146707 1.275333 1.669312
O  1.088239 3.078714 2.304568
O  2.596692 2.92078 0.038305
O  1.389965 0.37953 -2.827808
N  2.327307 0.596566 -0.14309
N  -0.299819 1.668211 0.924698
C  1.713985 -0.618885 0.305717
C  0.305393 -0.714131 0.546352
C  3.261705 0.559819 -1.300807
C  -0.602797 0.475541 0.464919
C  2.064593 1.844288 0.431477
C  1.020654 1.849306 1.577467
C  2.522631 -1.779746 0.428406
C  -0.249241 -1.977636 0.888283
C  -1.931594 0.286071 -0.196226
C  2.700735 -0.202407 -2.507357
C  1.968343 -3.023157 0.782648
C  0.57815 -3.102792 1.006574
C  -3.147646 0.72416 0.378258
C  -2.002633 -0.317484 -1.480888
C  -4.388111 0.594808 -0.269663
C  -3.233179 -0.456108 -2.156099
C  -4.42744 0.00311 -1.551353
H  4.233408 0.115595 -1.008791
H  3.438361 1.614934 -1.567689
H  1.233686 1.044991 2.309674
H  3.60179 -1.704366 0.262701
H  -1.325984 -2.060446 1.06123
H  2.597952 -1.285127 -2.289566
H  3.42219 -0.078141 -3.341768
H  2.601918 -3.90807 0.889205
H  -1.068126 -0.643659 -1.950464
H  1.311931 3.802309 1.657501
H  -5.294321 0.948077 0.230843
H  -3.26286 -0.913021 -3.15061
H  -5.386364 -0.100609 -2.069732
H  1.151691 0.179759 -3.766593
