program: Gaussian 09
title: 000038545
version: EM64L-G09RevD.01
frameworkgroup: C1[X(C12H17BrIN)]
method: RPBEPBE
basis: SDD
operation: Freq
keyword: #p
keyword: freq=noraman
keyword: PBEPBE/SDD
title: #p freq=noraman PBEPBE/SDD
converged: YES YES NO NO
title: Mulliken charges:
elementType: I Br N C C C C C C C C C C C C H H H H H H H H H H H H H H H H H
charge: 0.021765 -0.002301 -0.092068 -0.328285 -0.536071 -0.319242 -0.297423 0.576641 -0.680984 -0.784924 -0.389878 -0.407642 -0.185973 -0.235737 -0.237925 0.178886 0.205114 0.235721 0.198637 0.180329 0.233978 0.250934 0.232590 0.238747 0.204504 0.210726 0.284699 0.283393 0.243955 0.248879 0.232195 0.236760
chargesum: 0.00000
title: Mulliken charges with hydrogens summed into heavy atoms:
elementType: I Br N C C C C C C C C C C C C
charge: 0.021765 -0.002301 -0.092068 0.055715 -0.101713 0.095065 0.186101 0.576641 -0.027006 -0.216832 -0.389878 -0.163688 0.062905 -0.003542 -0.001165
polarizability: 2.37003564e+02 -2.24508293e+01 1.69347818e+02 1.18273333e+01 -1.90625959e+01 1.13596034e+02
1716.lowfreq: -7.9285 -5.3481 -0.0005 0.0002 0.0004 2.2200 15.6390 22.4869 36.3842
frequency: 15.6185 22.4201 36.2197 47.1932 61.2676 82.1834 96.6577 105.6623 139.3172 159.3535 183.7190 226.3416 237.0445 273.0313 290.4183 301.7533 367.4414 402.8180 430.8061 440.4309 466.3342 521.9043 571.4904 616.3431 648.5943 718.0119 736.4934 755.0376 784.0485 801.4771 810.1770 835.8308 873.6221 936.1623 950.4224 979.0785 987.9881 996.4929 1007.1798 1020.6183 1037.4424 1047.6891 1059.4637 1087.6660 1104.2380 1128.5264 1162.8749 1173.6358 1188.5296 1206.5984 1212.1357 1239.8213 1264.8585 1279.1772 1282.3600 1292.3060 1306.8076 1359.9659 1367.2681 1369.5641 1378.2350 1389.0986 1421.2949 1445.3767 1456.0418 1460.4503 1469.2329 1472.7946 1473.5585 1481.2728 1488.4563 1571.7616 1599.0313 2835.2020 2839.1336 2853.1644 2983.7705 3017.9452 3035.5292 3037.9711 3039.2071 3044.9494 3075.0655 3081.0598 3093.7861 3120.8356 3129.0848 3139.9590 3157.3879 3172.5218
redmass: 8.1664 11.1149 3.8369 2.2795 2.6960 4.3316 2.7692 2.6274 3.4914 3.9666 4.0755 1.6059 3.8753 3.4527 2.4746 4.6735 3.3803 2.3340 3.6348 3.3358 3.2351 3.6982 4.9701 4.4656 6.2938 4.2455 1.0968 1.3626 2.3960 1.2310 1.2924 3.0744 1.4467 2.1634 1.3997 1.7171 1.3416 1.4847 6.1338 2.6899 2.5703 3.2589 2.5166 2.2663 1.7883 1.5856 1.6043 1.0850 1.4101 1.5409 2.3575 1.4805 1.2218 1.1925 1.2595 1.1794 1.3161 1.3243 1.4019 2.7832 1.8316 1.2364 2.0997 1.1025 2.2359 1.0687 1.0800 1.1381 1.0665 1.0791 1.0671 6.0026 7.0341 1.0720 1.0726 1.0708 1.0360 1.0621 1.0838 1.0868 1.0848 1.0576 1.0979 1.1031 1.1003 1.0880 1.1101 1.0885 1.0944 1.0999
irintensity: 0.0325 0.1049 0.1969 0.5458 0.0265 0.2323 1.2219 0.3362 0.3446 0.5596 1.4145 2.4507 3.3924 0.7355 2.0832 0.8307 2.0449 2.6558 6.4399 11.7497 3.6163 3.7595 23.6228 13.6716 14.7901 2.6523 11.1469 78.6701 20.4989 5.4353 1.4953 4.5265 1.9750 8.0298 3.1301 3.1919 0.0126 15.4188 59.4804 0.6604 18.0700 6.5975 29.4570 9.9454 21.3824 8.2449 12.3445 1.0786 15.9804 33.2876 10.5860 21.6738 2.8752 0.3869 8.0613 8.8340 43.0705 1.7504 20.9067 5.0260 0.8336 21.9708 23.5246 2.9953 29.1513 3.6841 3.9981 7.1079 0.5824 12.9713 9.7699 12.8773 3.2206 38.1129 39.9115 238.9428 29.9825 9.1366 4.7500 12.7771 14.4478 32.8640 56.6277 15.5973 34.9205 7.1890 15.4871 7.1658 17.5387 17.6561
temp: 298.150 k
press: 1.00000 atm
elementType: 53 35 7 6 6 6 6 6 6 6 6 6 6 6 6 1 1 1 1 1 1 1 1 1 1 1 1 1 1 1 1 1
symmnumber: 1
zpe: 687081.8 jmol-1
zpe.correction: 0.261696 hartree
zpe.thermalcorrener: 0.278777 hartree
zpe.thermalcorrenthalpy: 0.279722 hartree
zpe.thermalcorrgfe: 0.211458 hartree
zpe.sumelectzpe: -546.022049 hartree
zpe.sumelectthermal: -546.004967 hartree
zpe.sumelectthermalent: -546.004023 hartree
zpe.sumelectthermalfe: -546.072286 hartree
dipole: -3.3755 3.0300 -1.1095
dipole: 4.6697
quadrupole: -109.9311 -108.6020 -116.2805
quadrupole: 2.0308 2.0356 -3.5076
quadrupole: 1.6734 3.0026 -4.6760 2.0308 2.0356 -3.5076
hfenergy: -546.2837448 hartree
pointgroup: C01 [X(C12H17Br1I1N1)]
dipole: 1.0555438 1.3477821 0.6667717 debye
polarizability: 224.9490371|33.5705832|172.1595367|10.934755|31.1816095|122.8388417 unknown
InChI: InChI=1S/C12H17BrIN/c1-2-15(9-5-8-14)10-11-6-3-4-7-12(11)13/h3-4,6-7H,2,5,8-10H2,1H3
charge 0 multiplicity 1
32 atoms
I  -5.492468 -2.138982 -0.246306
Br 0.27171 -2.183483 -1.148205
N  -0.801043 1.015298 0.054663
C  -2.252136 1.01428 0.36998
C  -0.019508 0.249865 1.064417
C  -0.254269 2.376488 -0.193908
C  -2.952981 -0.306998 -0.045307
C  1.393624 -0.08817 0.610326
C  -0.700985 2.967351 -1.544512
C  -4.445139 -0.251632 0.295303
C  1.697311 -1.092485 -0.343876
C  2.494577 0.612845 1.172848
C  3.020578 -1.379094 -0.740711
C  3.827497 0.34346 0.794735
C  4.090983 -0.654025 -0.169839
H  -2.435187 1.2112 1.458845
H  -2.722481 1.847237 -0.183184
H  -0.567339 -0.688337 1.265822
H  0.045303 0.804555 2.035816
H  -0.515869 3.081482 0.637728
H  0.846907 2.291655 -0.201986
H  -2.803175 -0.458076 -1.128324
H  -2.485592 -1.168584 0.46395
H  -0.419053 2.284349 -2.364286
H  -1.792894 3.130876 -1.595071
H  -0.212155 3.94492 -1.713211
H  -4.986355 0.524904 -0.268009
H  -4.637195 -0.139549 1.374433
H  2.286123 1.382936 1.925824
H  3.213354 -2.163264 -1.478822
H  4.650972 0.90454 1.248864
H  5.118384 -0.87736 -0.476398
