program: Gaussian 09
title: 000038633
version: EM64L-G09RevD.01
frameworkgroup: C1[X(C21H34N2O3)]
method: RPBEPBE
basis: SDD
operation: Freq
keyword: #p
keyword: freq=noraman
keyword: PBEPBE/SDD
title: #p freq=noraman PBEPBE/SDD
converged: YES YES NO NO
title: Mulliken charges:
elementType: O O O N N C C C C C C C C C C C C C C C C C C C C C H H H H H H H H H H H H H H H H H H H H H H H H H H H H H H H H H H
charge: -0.326600 -0.274915 -0.274667 -0.090089 -0.466311 -0.369477 -0.366773 -0.386660 -0.392089 -0.399699 -0.358605 0.030631 -0.713531 -0.359482 0.242897 -0.348360 -0.405168 -0.354634 -0.308639 0.518800 -0.694251 0.416261 -0.631034 -0.391532 -0.385909 -0.199909 0.209888 0.170976 0.175581 0.229685 0.191037 0.201525 0.202182 0.193773 0.213472 0.189740 0.200634 0.222837 0.241652 0.224932 0.237574 0.213284 0.188569 0.186662 0.190146 0.190469 0.212937 0.214117 0.195103 0.194604 0.205968 0.204877 0.331657 0.210545 0.210413 0.216558 0.247681 0.299719 0.249332 0.221615
chargesum: 0.00000
title: Mulliken charges with hydrogens summed into heavy atoms:
elementType: O O O N N C C C C C C C C C C C C C C C C C C C C C
charge: -0.326600 -0.274915 -0.274667 -0.090089 -0.134654 0.011387 0.038493 0.005901 0.003866 0.003513 0.064866 0.272284 -0.037741 0.015749 0.242897 0.032254 0.021886 0.035073 0.102206 0.518800 -0.056735 0.416261 -0.383353 -0.091813 -0.136577 0.021706
polarizability: 3.93800623e+02 -4.77516817e+00 2.36477947e+02 -6.05920755e+00 1.06634469e-01 1.73747691e+02
1716.lowfreq: -5.6734 -2.1105 -0.0022 -0.0006 0.0030 4.8362 10.3663 13.1131 24.3301
frequency: 4.0732 12.9509 23.9450 28.2267 31.7119 48.9996 55.6446 62.0340 75.3445 78.0541 88.2374 89.9482 116.1286 127.7505 133.7599 150.2525 155.6838 188.5488 206.3231 223.9916 224.8407 226.0093 235.7208 242.9753 254.3978 262.8963 289.2472 317.4667 339.3783 356.3017 384.7270 404.5531 413.8665 421.2666 436.8877 450.3486 454.4449 475.9180 499.1469 566.2906 591.7433 600.3907 616.6583 651.1076 689.4945 700.3765 704.0447 727.7502 747.8138 751.2535 766.9553 780.7563 802.5543 810.6009 842.2137 849.3147 854.0543 869.3937 882.6660 883.6989 884.2921 890.5782 894.1477 904.7131 932.6125 957.2244 969.9267 978.7767 984.3576 988.1924 995.8740 1011.6523 1026.5630 1043.6347 1047.5433 1049.1053 1060.4281 1070.9967 1083.8230 1100.4710 1102.7762 1116.3787 1126.2640 1137.3256 1146.0929 1147.8602 1151.2900 1156.8035 1161.0275 1170.5207 1194.0424 1196.3837 1215.4112 1237.0099 1246.3299 1257.3995 1264.8607 1272.6489 1279.4083 1281.6482 1288.5386 1291.8183 1293.3884 1294.4922 1311.3541 1314.4307 1330.1765 1336.0999 1338.7959 1340.9099 1344.5650 1350.8503 1355.8803 1372.8163 1377.6394 1378.1938 1387.7579 1389.6193 1395.0258 1421.4076 1451.3836 1458.4486 1460.0707 1465.8198 1466.4231 1467.6911 1468.5681 1469.5690 1472.8924 1475.7923 1475.8281 1479.3341 1480.9513 1484.5761 1488.2736 1492.8675 1525.2642 1595.3255 1625.8104 1657.4972 2827.0527 2838.2652 2903.4420 2944.2369 2952.5916 2957.5690 2966.3708 2968.1913 2972.1302 2983.0146 2986.0029 2989.9661 2990.1050 2993.2541 3001.3393 3006.0822 3021.2564 3025.8451 3031.1899 3032.5487 3040.0290 3043.6419 3045.1666 3054.1506 3060.9722 3068.8050 3071.9162 3091.9179 3100.3916 3137.3332 3140.8300 3172.8166 3198.4438 3543.1756
redmass: 4.4046 4.4843 4.6539 4.2807 3.1237 2.7421 2.2663 3.4320 4.5573 4.7158 3.2691 4.2376 1.7700 3.0012 3.4875 2.4620 3.2720 2.5212 2.3875 2.0772 1.3346 1.6241 5.2032 1.9946 4.2224 3.8815 2.4923 4.7827 3.5952 2.5177 1.9665 3.2810 3.3564 3.9000 2.4873 2.7248 2.9692 2.8264 3.8871 2.1822 5.6810 3.0277 5.3693 1.6493 2.0454 4.6833 6.4390 1.0668 4.9449 1.1017 3.8974 1.3746 1.4815 1.1509 2.6941 2.1388 1.9734 1.6936 2.5111 1.4232 2.2753 2.2519 1.2236 2.6961 1.5407 1.3124 6.7314 1.2950 6.5293 1.1396 2.4404 3.8336 3.1536 2.0944 2.1202 3.0480 1.6774 2.6044 2.0497 1.6349 1.9634 2.4085 2.7784 1.5756 1.6529 1.4249 1.9285 2.0469 2.1297 1.9526 1.3281 1.5442 1.7068 1.2882 1.3042 1.2748 1.1968 2.1270 1.0743 1.4182 1.1424 1.1060 1.3574 1.3029 1.4066 1.5299 1.2941 1.4026 1.4213 1.4435 1.4583 1.4235 1.6447 1.3735 1.3266 1.6881 1.2170 1.4305 3.7361 2.7395 1.0910 1.0800 1.0865 1.0715 1.0919 1.0737 1.0796 1.0474 1.0861 1.0429 1.0687 1.1366 1.0944 1.7254 1.2618 1.1467 2.2411 5.3471 6.5958 8.5967 1.0712 1.0703 1.0683 1.0552 1.0588 1.0589 1.0626 1.0595 1.0360 1.0615 1.0610 1.0979 1.0356 1.0593 1.1053 1.1024 1.0889 1.0878 1.1046 1.0950 1.0892 1.0911 1.1014 1.1036 1.1049 1.1008 1.0993 1.0993 1.0999 1.0886 1.0917 1.0938 1.0950 1.0760
irintensity: 0.0757 0.0694 0.1474 0.1225 0.1574 0.6156 0.1650 0.7605 2.3699 2.6791 0.2793 0.6746 0.6558 1.0421 1.1128 0.9576 1.6394 2.1932 9.1351 1.6709 0.5059 1.0679 0.3001 0.8312 1.7352 5.7830 1.0145 1.8150 10.1056 2.5049 6.0269 4.6083 1.6613 0.8208 8.5025 0.2859 7.5675 2.6369 1.0699 0.6739 12.5144 10.3382 1.0058 25.1794 25.7586 53.9548 10.3863 11.9351 4.5883 1.1135 4.7758 44.7222 0.1031 0.0093 28.3280 5.1074 2.8729 55.2065 5.6172 10.7263 5.4550 26.4521 0.3149 5.4920 1.4502 3.0910 273.9993 3.0400 87.9934 1.2149 19.1102 23.3588 26.5946 89.0031 103.4138 11.3903 123.2801 12.8952 6.4898 17.1736 45.7975 9.0445 7.2145 27.7855 16.8154 1.1650 50.2731 57.1619 82.0243 432.8339 71.2708 1.2744 2.8146 6.2561 0.0511 1.0350 3.9814 143.8488 0.1213 19.1867 0.1800 1.3516 4.1764 5.0363 29.4737 4.1390 0.7284 4.5729 2.2276 1.0945 2.0419 1.8648 0.1210 1.7965 21.7644 6.3545 11.3740 66.7614 169.4823 155.3326 7.1921 8.4599 14.3138 0.0185 13.9384 0.2679 1.6861 10.0271 10.5414 12.7135 4.3318 16.1716 12.6281 162.5603 29.8342 42.7214 306.4309 73.7485 426.1809 208.6776 60.9195 120.7354 92.7667 25.8662 7.2523 11.4534 39.1483 88.5449 41.2232 35.4095 34.7452 1.0929 20.0424 40.6730 25.3998 0.0418 19.3334 46.1906 35.0539 80.9811 3.9277 46.5543 6.0425 97.2534 58.9386 114.7857 54.1320 32.6025 21.8363 18.4742 3.1655 11.8425 7.3424 27.8151
temp: 298.150 k
press: 1.00000 atm
elementType: 8 8 8 7 7 6 6 6 6 6 6 6 6 6 6 6 6 6 6 6 6 6 6 6 6 6 1 1 1 1 1 1 1 1 1 1 1 1 1 1 1 1 1 1 1 1 1 1 1 1 1 1 1 1 1 1 1 1 1 1
symmnumber: 1
zpe: 1364064.2 jmol-1
zpe.correction: 0.519545 hartree
zpe.thermalcorrener: 0.547980 hartree
zpe.thermalcorrenthalpy: 0.548924 hartree
zpe.thermalcorrgfe: 0.454676 hartree
zpe.sumelectzpe: -1153.779258 hartree
zpe.sumelectthermal: -1153.750822 hartree
zpe.sumelectthermalent: -1153.749878 hartree
zpe.sumelectthermalfe: -1153.844127 hartree
dipole: -1.5143 -0.8215 1.0526
dipole: 2.0189
quadrupole: -128.8506 -154.5179 -160.5397
quadrupole: -8.4229 3.7543 0.7315
quadrupole: 19.1188 -6.5485 -12.5703 -8.4229 3.7543 0.7315
hfenergy: -1154.2988023 hartree
pointgroup: C01 [X(C21H34N2O3)]
dipole: -0.5984385 -0.2305625 0.4686422 debye
polarizability: 393.922803|-5.0159873|233.6117455|-3.0603151|-13.0396919|176.4917126 unknown
InChI: InChI=1S/C21H34N2O3/c1-3-4-5-9-15-25-20-12-10-11-19(16-20)22-21(24)26-18(2)17-23-13-7-6-8-14-23/h10-12,16,18,22H,3-9,13-15,17H2,1-2H3
charge 0 multiplicity 1
60 atoms
O  2.725555 -1.460411 -0.695176
O  -4.131827 -0.293221 -0.257547
O  2.432615 0.83804 -1.156028
N  6.179792 -0.409688 0.414498
N  0.631216 -0.627156 -0.657719
C  7.029539 -0.72873 1.589659
C  6.283403 1.02627 0.039377
C  8.510013 -0.409659 1.294907
C  7.738233 1.401411 -0.305406
C  8.680502 1.068799 0.874731
C  4.775687 -0.858554 0.551512
C  4.210887 -1.293986 -0.822669
C  4.756579 -2.635558 -1.30434
C  -7.910935 0.159167 0.010429
C  1.959618 -0.289791 -0.86227
C  -9.053623 -0.795813 0.423031
C  -6.51975 -0.513335 0.060114
C  -10.44907 -0.133576 0.367155
C  -5.399978 0.458003 -0.318143
C  -0.510246 0.216496 -0.743077
C  -11.585984 -1.089147 0.789009
C  -2.946304 0.401734 -0.545984
C  -1.767712 -0.374586 -0.475847
C  -0.424894 1.595386 -1.081177
C  -2.8809 1.776728 -0.885223
C  -1.614112 2.347115 -1.145825
H  6.912299 -1.80355 1.823295
H  6.706492 -0.151415 2.496633
H  5.924798 1.678067 0.879685
H  5.618046 1.220636 -0.820816
H  9.120905 -0.635367 2.190386
H  8.856804 -1.068477 0.475062
H  8.051063 0.833141 -1.202741
H  7.790605 2.478741 -0.554805
H  9.732991 1.274454 0.601931
H  8.435514 1.725506 1.735554
H  4.734989 -1.724124 1.239576
H  4.119906 -0.062702 0.976982
H  4.391332 -0.494156 -1.563488
H  4.402331 -2.870611 -2.32249
H  5.859247 -2.581441 -1.310543
H  4.443747 -3.450493 -0.626866
H  -8.104962 0.537944 -1.015026
H  -7.920462 1.046473 0.67807
H  -8.866688 -1.16922 1.451437
H  -9.044847 -1.687715 -0.237717
H  -6.324842 -0.906144 1.076561
H  -6.492369 -1.37872 -0.629635
H  -10.636699 0.234913 -0.662167
H  -10.454167 0.761073 1.023083
H  -5.546681 0.855484 -1.344617
H  -5.360915 1.312459 0.390006
H  0.472765 -1.610467 -0.427233
H  -11.623652 -1.976777 0.129483
H  -11.43796 -1.448309 1.825007
H  -12.572011 -0.591507 0.741812
H  -1.857522 -1.434148 -0.210737
H  0.547134 2.046833 -1.284324
H  -3.781481 2.392716 -0.94786
H  -1.554612 3.409463 -1.40809
