program: Gaussian 09
title: 000038559
version: EM64L-G09RevD.01
frameworkgroup: C1[X(C14H21Br2N)]
method: RPBEPBE
basis: SDD
operation: Freq
keyword: #p
keyword: freq=noraman
keyword: PBEPBE/SDD
title: #p freq=noraman PBEPBE/SDD
converged: YES YES NO NO
title: Mulliken charges:
elementType: Br Br N C C C C C C C C C C C C C C H H H H H H H H H H H H H H H H H H H H H
charge: -0.075673 -0.022208 -0.093600 -0.352972 -0.387931 -0.298945 -0.534754 -0.321852 -0.439874 0.574942 -0.679931 -0.654125 -0.383545 -0.407044 -0.188275 -0.235538 -0.237289 0.183648 0.206239 0.234497 0.205364 0.218761 0.222683 0.199181 0.234485 0.231820 0.182495 0.285584 0.206696 0.236157 0.209452 0.244063 0.238252 0.235788 0.245213 0.248798 0.232562 0.236879
chargesum: 0.00000
title: Mulliken charges with hydrogens summed into heavy atoms:
elementType: Br Br N C C C C C C C C C C C C C C
charge: -0.075673 -0.022208 -0.093600 0.036915 0.051929 0.142499 -0.101089 0.092463 -0.154290 0.574942 -0.027627 0.063978 -0.383545 -0.161830 0.060522 -0.002976 -0.000410
polarizability: 2.71347613e+02 7.15485879e+00 1.73663095e+02 -2.32255443e+00 -1.99205023e+01 1.34336180e+02
1716.lowfreq: -16.5424 -0.0003 -0.0001 0.0004 1.8439 5.9060 15.1815 18.6696 24.8993
frequency: -2.2062 18.1465 24.8450 38.8664 62.0129 78.4757 90.8279 104.1843 115.2975 127.4059 141.6554 191.4437 216.3025 227.3425 247.1625 259.3567 274.7449 279.5630 290.2819 316.4035 370.1845 406.2221 418.0935 438.1458 450.3024 470.8878 526.2903 584.0810 611.6964 647.6172 716.6860 748.1196 755.5214 781.4977 804.0859 824.7583 847.1083 874.6050 889.4979 939.0658 951.7986 977.9804 987.6110 988.6361 993.6325 1006.0101 1026.9091 1036.3267 1044.4396 1065.6601 1087.2694 1106.5217 1128.6487 1130.3255 1153.6159 1168.3155 1175.3127 1200.8192 1212.0704 1220.7111 1242.7480 1258.7877 1279.2428 1285.1253 1293.6913 1295.2227 1328.9242 1341.4928 1363.5451 1369.9521 1370.9451 1379.6968 1387.9026 1388.9302 1420.7560 1455.8465 1456.9831 1460.0852 1461.4874 1471.4945 1474.0920 1475.5035 1476.2072 1484.4427 1489.9752 1571.3007 1599.0965 2841.3112 2841.3667 2856.5325 2979.2891 2982.3417 2984.0521 2989.4212 3029.6897 3031.9508 3036.6271 3037.4852 3054.1284 3069.4321 3075.6366 3076.0631 3093.7867 3106.9234 3122.0062 3140.4429 3157.6796 3172.9574
redmass: 3.8528 5.4085 8.7563 4.5949 3.5013 5.3257 2.5646 2.3178 3.4794 2.4223 3.4992 2.1215 2.9963 1.1859 1.9346 5.0028 2.9562 3.6689 2.5946 3.9272 2.8659 2.4466 2.3471 3.1481 3.5818 3.4833 3.6472 3.3007 4.6018 6.3814 4.2610 1.1269 1.3783 2.3116 1.2235 2.3452 1.7492 1.4303 2.1782 2.0037 1.3923 1.4950 1.4609 1.5024 1.6563 5.8662 3.3930 2.4428 2.2387 2.4476 2.3361 1.8707 1.7815 1.8424 1.8773 1.4322 1.1620 1.7391 2.3941 1.3777 1.4635 1.2637 1.1883 1.3049 1.2099 1.1694 1.3458 1.4499 1.3269 3.5830 1.3577 1.6828 1.2470 1.2195 2.0963 1.6027 1.2951 1.0708 1.0494 1.0627 1.1257 1.0771 1.0724 1.0863 1.0719 5.9565 7.0043 1.0718 1.0723 1.0707 1.0423 1.0575 1.0359 1.0605 1.0875 1.0877 1.0915 1.0892 1.0924 1.1012 1.0942 1.0980 1.1003 1.1005 1.0878 1.0887 1.0944 1.0999
irintensity: 0.6893 0.2490 0.0547 0.1551 0.3733 1.0525 0.8610 0.5833 0.3788 0.1921 0.3283 0.7351 3.0576 0.5333 0.8254 5.1192 0.4450 4.7706 3.6777 0.3193 0.3727 1.7774 0.9764 6.3195 28.2174 1.0773 3.1345 27.5793 9.3281 16.9728 3.1011 10.5711 71.4690 19.6272 5.8573 4.6376 2.8067 2.1557 4.8804 12.9065 2.7810 2.8682 4.9247 8.9122 6.2805 70.4719 20.7009 6.3917 4.1690 26.1390 20.4047 36.2345 13.8574 10.0511 10.4426 35.4561 10.3775 7.2728 8.4923 8.0149 25.7434 15.9080 10.4143 7.5345 32.1339 16.8960 2.4031 3.2305 2.3984 4.9573 24.2425 2.9797 14.2646 28.8110 22.5605 24.3595 6.2874 1.7448 10.5790 4.3361 11.3433 3.2395 0.3028 16.6161 9.1218 13.3351 3.0619 34.4502 41.8867 225.0898 11.4681 5.7758 29.2129 39.1037 4.9316 14.1707 6.8787 14.4957 3.8898 55.0100 35.6327 58.4532 36.1225 26.1529 6.5568 7.2444 17.2485 17.7351
temp: 298.150 k
press: 1.00000 atm
elementType: 35 35 7 6 6 6 6 6 6 6 6 6 6 6 6 6 6 1 1 1 1 1 1 1 1 1 1 1 1 1 1 1 1 1 1 1 1 1
symmnumber: 1
zpe: 834000.5 jmol-1
zpe.correction: 0.317654 hartree
zpe.thermalcorrener: 0.336484 hartree
zpe.thermalcorrenthalpy: 0.337428 hartree
zpe.thermalcorrgfe: 0.267020 hartree
zpe.sumelectzpe: -626.426120 hartree
zpe.sumelectthermal: -626.407290 hartree
zpe.sumelectthermalent: -626.406346 hartree
zpe.sumelectthermalfe: -626.476754 hartree
dipole: 4.2510 1.4348 -0.0765
dipole: 4.4872
quadrupole: -130.4111 -118.1770 -123.9032
quadrupole: 3.8606 -6.7658 -3.0848
quadrupole: -6.2474 5.9868 0.2606 3.8606 -6.7658 -3.0848
hfenergy: -626.7437739 hartree
pointgroup: C01 [X(C14H21Br2N1)]
dipole: -1.6654614 -0.5855675 0.007229 debye
polarizability: 270.8165568|10.400078|167.5682302|-6.3109027|24.025204|140.9621011 unknown
InChI: InChI=1S/C14H21Br2N/c1-3-17(10-6-7-12(2)15)11-13-8-4-5-9-14(13)16/h4-5,8-9,12H,3,6-7,10-11H2,1-2H3
charge 0 multiplicity 1
38 atoms
Br 6.476606 0.639048 -0.936449
Br -0.777847 2.230688 0.820925
N  -0.03541 -1.175266 -0.050279
C  1.404903 -1.334626 -0.377719
C  2.241329 -0.074099 -0.062052
C  3.737265 -0.28741 -0.411992
C  -0.764891 -0.446068 -1.12237
C  -0.696411 -2.446908 0.348018
C  4.564889 0.992253 -0.218447
C  -2.128304 0.070697 -0.683299
C  -0.28498 -2.918081 1.755641
C  4.686112 1.484936 1.225503
C  -2.316038 1.190026 0.166381
C  -3.303375 -0.581238 -1.146566
C  -3.595933 1.632965 0.561048
C  -4.595669 -0.156915 -0.769882
C  -4.742335 0.951897 0.092381
H  1.550842 -1.619123 -1.452026
H  1.80287 -2.173189 0.222395
H  2.11213 0.159863 1.009971
H  1.847142 0.794906 -0.625507
H  4.162567 -1.095365 0.215196
H  3.823474 -0.617732 -1.465054
H  -0.907343 -1.087687 -2.029974
H  -0.134404 0.4082 -1.429773
H  -1.786572 -2.269053 0.347752
H  -0.504667 -3.260834 -0.398496
H  4.218243 1.794734 -0.89232
H  0.793921 -3.147711 1.823271
H  -0.514022 -2.132407 2.496192
H  -0.837869 -3.836229 2.028573
H  5.331765 2.375903 1.294332
H  5.103949 0.698323 1.877743
H  3.682878 1.757486 1.60733
H  -3.185777 -1.439687 -1.819243
H  -3.697069 2.50187 1.217949
H  -5.477962 -0.68553 -1.145694
H  -5.736507 1.295362 0.397342
