program: Gaussian 09
title: 000038547
version: EM64L-G09RevD.01
frameworkgroup: C1[X(C13H19BrClN)]
method: RPBEPBE
basis: SDD
operation: Freq
keyword: #p
keyword: freq=noraman
keyword: PBEPBE/SDD
title: #p freq=noraman PBEPBE/SDD
converged: YES YES NO NO
title: Mulliken charges:
elementType: Br Cl N C C C C C C C C C C C C C H H H H H H H H H H H H H H H H H H H
charge: -0.020665 -0.082577 -0.157229 -0.343359 -0.327780 -0.482144 -0.353275 -0.389334 0.518269 -0.569836 -0.675422 -0.415375 -0.350884 -0.197541 -0.243939 -0.238984 0.204032 0.205610 0.192538 0.224247 0.244454 0.231103 0.222403 0.226917 0.195231 0.208051 0.282774 0.249960 0.212139 0.223723 0.214929 0.272464 0.250211 0.233223 0.236064
chargesum: 0.00000
title: Mulliken charges with hydrogens summed into heavy atoms:
elementType: Br Cl N C C C C C C C C C C C C C
charge: -0.020665 -0.082577 -0.157229 0.066283 0.089005 -0.006587 0.096046 0.013948 0.518269 -0.037102 -0.024630 -0.415375 -0.078420 0.052670 -0.010716 -0.002921
polarizability: 1.89962244e+02 9.84068592e+00 1.47718399e+02 9.66017402e-01 2.01559813e+01 1.72135136e+02
1716.lowfreq: -9.9497 -4.1808 0.0011 0.0016 0.0021 3.7755 13.5650 24.8457 30.8382
frequency: 13.4553 24.7027 30.5090 51.8537 68.4078 69.9785 95.0585 123.5071 133.5807 169.6158 194.5938 219.1002 230.1392 244.0945 277.7501 290.7100 319.4257 332.3166 357.3399 410.4865 439.5130 490.2798 500.4386 536.8394 597.0777 655.1646 681.3772 700.3514 728.5431 762.3006 780.7595 799.3864 821.9438 859.5004 875.0353 881.8104 910.5259 935.7895 960.7640 987.3453 998.6523 1003.2000 1018.2274 1034.9565 1059.3504 1068.7426 1091.2381 1099.4981 1109.4684 1118.9106 1152.5642 1167.0596 1193.4566 1206.2052 1230.6961 1247.9810 1257.8433 1267.2057 1272.2530 1284.0792 1290.3347 1337.2496 1347.2984 1352.9447 1370.3843 1371.3948 1381.4548 1391.0014 1421.2460 1443.7270 1456.3055 1459.6299 1466.4757 1467.3368 1474.7615 1480.3661 1482.8876 1489.2004 1568.8549 1601.2204 2853.1312 2864.7018 2887.2507 2978.0789 2981.7284 3007.0091 3012.8836 3016.5786 3033.2593 3038.2175 3055.2760 3065.4552 3073.4839 3081.2159 3133.8801 3148.9428 3149.5137 3160.5034 3173.9579
redmass: 9.3009 5.9761 3.9228 3.0311 2.5502 3.6673 5.7566 3.2082 3.7503 3.3307 1.4351 3.0872 2.7084 3.1924 5.5732 2.4391 2.4958 2.3431 3.1409 2.8918 3.1520 3.2467 3.7235 2.9122 5.2932 6.5485 3.7788 3.2467 1.9655 1.2249 1.2633 3.1596 1.8631 2.1282 1.3435 1.7678 1.4164 1.8728 1.4909 1.8929 2.5028 2.1128 1.7478 2.0400 1.5975 2.1339 2.3644 2.5037 1.6730 1.7027 2.0222 1.0640 1.9238 2.1258 1.3137 1.3251 1.3178 1.2067 1.1774 1.2292 1.3107 1.6388 1.4598 1.7465 1.3720 1.3882 1.9152 1.3913 2.0750 1.6449 1.1982 1.2805 1.0697 1.0778 1.0611 1.0919 1.0710 1.0695 6.1660 6.9684 1.0716 1.0716 1.0699 1.0390 1.0580 1.0613 1.0859 1.0932 1.0929 1.0899 1.0656 1.0927 1.0996 1.0998 1.0856 1.0957 1.1029 1.0949 1.0995
irintensity: 0.4414 0.2722 0.6544 0.1681 1.8790 0.2565 2.6784 0.3516 0.0338 0.7601 0.6688 1.3539 2.3054 5.0755 0.9607 0.8438 1.1017 1.4827 6.7207 1.5809 8.6955 9.4757 0.2295 11.0979 2.3562 27.1395 34.0732 4.5621 5.0114 79.5917 7.2788 5.3805 4.9933 5.2536 1.1631 9.8547 3.0382 10.7342 5.4991 21.1376 52.6777 17.4756 7.0088 14.9854 8.6163 17.4468 3.9170 7.7098 11.3343 16.2970 18.0459 1.5564 8.6525 8.7957 13.1876 4.6557 1.3636 21.2718 9.6122 7.2783 4.5147 12.1990 4.4065 4.8125 9.3849 3.6652 6.0630 15.8684 22.3004 41.5710 2.3809 7.6480 1.6158 0.0491 9.4407 19.5505 9.6585 27.9436 18.5679 4.9876 46.6464 122.0905 61.8341 42.9991 23.0485 15.3383 14.9453 7.1673 33.5324 16.3769 23.3727 40.5557 73.0432 57.7697 2.6512 3.4052 20.4348 11.1272 17.7744
temp: 298.150 k
press: 1.00000 atm
elementType: 35 17 7 6 6 6 6 6 6 6 6 6 6 6 6 6 1 1 1 1 1 1 1 1 1 1 1 1 1 1 1 1 1 1 1
symmnumber: 1
zpe: 764486.1 jmol-1
zpe.correction: 0.291177 hartree
zpe.thermalcorrener: 0.309073 hartree
zpe.thermalcorrenthalpy: 0.310017 hartree
zpe.thermalcorrgfe: 0.241032 hartree
zpe.sumelectzpe: -1033.801482 hartree
zpe.sumelectthermal: -1033.783586 hartree
zpe.sumelectthermalent: -1033.782642 hartree
zpe.sumelectthermalfe: -1033.851627 hartree
dipole: -0.1366 2.8895 -1.2432
dipole: 3.1485
quadrupole: -121.6305 -117.8537 -108.6589
quadrupole: 7.4164 -12.4403 5.6204
quadrupole: -5.5828 -1.8060 7.3888 7.4164 -12.4403 5.6204
hfenergy: -1034.092659 hartree
pointgroup: C01 [X(C13H19Br1Cl1N1)]
dipole: 0.0785121 1.2273385 0.1480131 debye
polarizability: 186.0761746|-8.2963611|139.3766395|4.9027252|-12.6358714|184.3629644 unknown
InChI: InChI=1S/C13H19BrClN/c1-2-9-16(10-5-8-15)11-12-6-3-4-7-13(12)14/h3-4,6-7H,2,5,8-11H2,1H3
charge 0 multiplicity 1
35 atoms
Br 2.912764 -1.266891 2.524826
Cl -3.78755 -2.743747 -1.499101
N  -1.042855 0.540564 0.714134
C  -2.334747 0.084914 1.296686
C  -0.787789 1.99518 0.937186
C  0.10121 -0.272836 1.197517
C  -2.855558 -1.242582 0.693912
C  -1.710641 2.946565 0.142867
C  1.298051 -0.288184 0.248131
C  -3.065896 -1.128799 -0.81617
C  -1.598882 2.791912 -1.388226
C  2.589788 -0.7012 0.656033
C  1.144102 0.070961 -1.116428
C  3.687883 -0.751828 -0.226795
C  2.224569 0.027784 -2.021781
C  3.502069 -0.381707 -1.578004
H  -2.268307 -0.028361 2.408296
H  -3.086306 0.872377 1.106973
H  -0.855616 2.241992 2.027936
H  0.257547 2.190189 0.632162
H  -0.238983 -1.317438 1.332927
H  0.438719 0.065539 2.206762
H  -2.162258 -2.077424 0.904907
H  -3.813754 -1.495271 1.185929
H  -2.765612 2.814675 0.45456
H  -1.439521 3.981506 0.4327
H  -2.12374 -0.973307 -1.358672
H  -3.797873 -0.350443 -1.082874
H  -0.563756 2.981218 -1.72932
H  -1.87558 1.769383 -1.701146
H  -2.264047 3.504247 -1.909617
H  0.145057 0.385481 -1.434449
H  4.668402 -1.07712 0.132537
H  2.070408 0.310309 -3.068777
H  4.350405 -0.418457 -2.26962
