program: Gaussian 09
title: 000038563
version: EM64L-G09RevD.01
frameworkgroup: C1[X(C14H21Br2N)]
method: RPBEPBE
basis: SDD
operation: Freq
keyword: #p
keyword: freq=noraman
keyword: PBEPBE/SDD
title: #p freq=noraman PBEPBE/SDD
converged: YES YES NO NO
title: Mulliken charges:
elementType: Br Br N C C C C C C C C C C C C C C H H H H H H H H H H H H H H H H H H H H H
charge: -0.051323 -0.021439 -0.141114 -0.369242 -0.386248 -0.343476 -0.493688 -0.327512 -0.306517 0.513432 -0.680964 -0.695047 -0.408670 -0.351405 -0.198632 -0.243390 -0.235919 0.196842 0.205070 0.198911 0.199404 0.185345 0.218322 0.233710 0.246176 0.194131 0.230033 0.220331 0.226862 0.207894 0.220846 0.215904 0.276732 0.278786 0.269815 0.249855 0.230536 0.235648
chargesum: 0.00000
title: Mulliken charges with hydrogens summed into heavy atoms:
elementType: Br Br N C C C C C C C C C C C C C C
charge: -0.051323 -0.021439 -0.141114 0.032670 0.012066 0.060191 -0.013801 0.096652 0.140677 0.513432 -0.036319 -0.139529 -0.408670 -0.081590 0.051223 -0.012854 -0.000272
polarizability: 2.11397662e+02 -3.70467315e+00 1.77092502e+02 -1.89038031e+01 -1.58830049e+01 1.76725600e+02
1716.lowfreq: -14.6973 -8.3900 -3.5702 -0.0006 -0.0005 -0.0003 7.0381 13.1635 30.2940
frequency: 5.4676 12.2935 30.2609 43.1234 47.3655 63.1625 84.6734 98.3555 104.9048 123.9267 133.3924 158.5146 190.0095 219.8194 234.4365 271.4837 278.3096 282.1332 329.9194 344.2630 372.4801 387.3180 438.1504 491.8249 501.4961 529.4846 593.4033 608.2889 654.4474 700.8873 728.7314 747.6375 761.5299 778.3977 797.6860 804.6674 855.8261 873.3131 888.5730 925.6256 956.4468 986.4797 996.3134 1003.2817 1007.3758 1028.4127 1032.6149 1042.2609 1045.4938 1072.0800 1085.6398 1095.6422 1106.5870 1109.8333 1150.8453 1165.3694 1191.7654 1204.7707 1210.6633 1238.0923 1240.9758 1252.3589 1273.1476 1281.4573 1284.1752 1292.8360 1296.0904 1331.3520 1344.0411 1354.3996 1367.1725 1372.2308 1384.2040 1391.6719 1420.0947 1441.0752 1448.6435 1454.2105 1464.4200 1466.7989 1468.5043 1471.4207 1479.3941 1484.5263 1488.9555 1567.6755 1600.4129 2863.5773 2870.7555 2884.9776 2964.6145 2974.2957 2985.6278 2994.9105 3010.2934 3012.7562 3028.3897 3031.0750 3042.7967 3046.6583 3060.3580 3080.2621 3087.1178 3129.2691 3131.9235 3142.2566 3155.8878 3172.5589
redmass: 9.0216 7.5918 2.7223 3.5790 2.9693 2.6993 3.7693 2.9600 3.4097 2.1524 3.6115 2.6093 4.0805 3.3067 1.7487 3.3654 2.7129 3.7559 2.6209 3.5034 2.4896 3.5355 3.1508 3.1435 3.3147 2.9268 5.2325 4.9222 6.5290 3.4420 1.4585 1.2887 1.2316 1.5655 1.5491 2.2650 1.5624 1.3721 1.7169 1.7635 1.4306 1.6453 4.6152 2.3985 1.5642 1.9934 2.0092 2.7463 1.6430 2.8802 2.3224 2.2141 1.6099 1.5737 2.1087 1.0707 1.9059 1.8199 1.3925 1.4014 1.4965 1.3054 1.2798 1.1731 1.0844 1.2363 1.2213 1.3879 1.8974 1.6416 1.3365 1.6297 2.0214 1.2508 2.0716 1.6215 1.1131 1.3547 1.0670 1.1229 1.0762 1.0673 1.0731 1.0953 1.0692 6.1799 6.9746 1.0718 1.0716 1.0702 1.0622 1.0603 1.0357 1.0601 1.0862 1.0949 1.0884 1.0959 1.0945 1.0563 1.1037 1.0982 1.1002 1.0857 1.1112 1.0901 1.0950 1.0992
irintensity: 0.1777 0.3592 0.7891 0.2384 0.3537 0.4866 1.0987 0.8931 0.6247 0.1388 0.0698 0.1118 1.2628 5.5582 0.1104 1.2591 3.3460 1.6511 3.1658 9.9390 4.3674 1.1508 8.1160 0.7992 0.3272 2.8610 3.2214 39.7901 26.5109 2.6683 6.9704 11.8866 75.9853 6.4522 7.5455 1.9577 2.0481 0.6665 0.2906 8.6316 0.2000 7.9483 72.0597 7.8392 13.2337 7.0051 16.3680 10.8335 2.2518 19.6300 11.3661 1.9286 11.0564 9.3403 34.9527 2.7023 9.0515 4.9090 21.1170 12.2520 23.2247 39.9076 3.5884 4.0095 3.9860 11.0730 13.5624 11.7286 10.4858 4.3014 12.4574 12.1919 3.3466 24.4946 20.7093 40.9599 5.5238 6.9835 2.3546 4.8487 1.6598 0.8263 11.1963 20.4699 13.6624 20.0499 4.8546 31.0698 116.8486 96.4899 10.0062 41.5438 27.2419 27.1911 10.7536 5.3810 15.0590 8.2984 43.6661 23.3717 71.1846 53.4580 48.6723 1.0394 19.3955 2.0189 17.5270 17.7655
temp: 298.150 k
press: 1.00000 atm
elementType: 35 35 7 6 6 6 6 6 6 6 6 6 6 6 6 6 6 1 1 1 1 1 1 1 1 1 1 1 1 1 1 1 1 1 1 1 1 1
symmnumber: 1
zpe: 835102.0 jmol-1
zpe.correction: 0.318074 hartree
zpe.thermalcorrener: 0.337742 hartree
zpe.thermalcorrenthalpy: 0.338686 hartree
zpe.thermalcorrgfe: 0.263033 hartree
zpe.sumelectzpe: -626.425895 hartree
zpe.sumelectthermal: -626.406227 hartree
zpe.sumelectthermalent: -626.405283 hartree
zpe.sumelectthermalfe: -626.480935 hartree
dipole: 1.4280 2.5850 1.4040
dipole: 3.2699
quadrupole: -148.6555 -116.8231 -118.6992
quadrupole: -9.8410 1.3544 -4.8879
quadrupole: -20.5962 11.2361 9.3601 -9.8410 1.3544 -4.8879
hfenergy: -626.7439686 hartree
pointgroup: C01 [X(C14H21Br2N1)]
dipole: -0.5101762 -1.0155174 0.6029155 debye
polarizability: 202.4971997|0.8125124|182.4529788|22.422334|19.139367|180.2655855 unknown
InChI: InChI=1S/C14H21Br2N/c1-2-17(11-7-3-6-10-15)12-13-8-4-5-9-14(13)16/h4-5,8-9H,2-3,6-7,10-12H2,1H3
charge 0 multiplicity 1
38 atoms
Br 5.836031 2.624222 0.401302
Br -3.603895 0.078812 -2.712783
N  -0.10071 -1.626983 -0.05296
C  1.065739 -2.232454 -0.750173
C  2.146197 -1.196997 -1.138446
C  2.81062 -0.531988 0.087374
C  -1.037103 -0.964717 -0.98989
C  -0.810427 -2.568909 0.859814
C  3.838763 0.555072 -0.318524
C  -1.814365 0.19354 -0.363883
C  -0.027353 -2.875982 2.149368
C  4.47147 1.197027 0.916532
C  -2.951011 0.772921 -0.977847
C  -1.391261 0.765241 0.864428
C  -3.651524 1.859136 -0.414792
C  -2.072143 1.852568 1.450355
C  -3.207472 2.401451 0.81274
H  1.521693 -2.974373 -0.069055
H  0.745251 -2.79538 -1.662174
H  1.704235 -0.412109 -1.785125
H  2.915465 -1.708732 -1.752312
H  3.312084 -1.311194 0.698861
H  2.01473 -0.093635 0.719981
H  -1.760149 -1.693054 -1.430413
H  -0.459272 -0.568193 -1.847173
H  -1.067147 -3.522543 0.333296
H  -1.770424 -2.094463 1.135394
H  4.629559 0.109713 -0.952045
H  3.338667 1.333233 -0.925884
H  0.931852 -3.385585 1.946948
H  0.19189 -1.941968 2.696604
H  -0.621425 -3.536289 2.807697
H  5.043919 0.479962 1.525714
H  3.739404 1.731889 1.541589
H  -0.505286 0.321395 1.331724
H  -4.524913 2.275078 -0.925316
H  -1.71887 2.271027 2.39909
H  -3.747219 3.244461 1.257085
