program: Gaussian 09
title: 000038498
version: EM64L-G09RevD.01
frameworkgroup: C1[X(C15H14N2)]
method: RPBEPBE
basis: SDD
operation: Freq
keyword: #pfreq=noraman
keyword: PBEPBE/SDD
title: #p freq=noraman PBEPBE/SDD
converged: NO YES NO NO
title: Mulliken charges:
elementType: N N C C C C C C C C C C C C C C C H H H H H H H H H H H H H H
charge: -0.028756 -0.684461 0.332581 -0.305329 0.259614 0.265923 0.458728 -0.080988 -0.608671 0.457528 -0.587138 -0.351336 -0.807059 -0.329732 -0.820245 -0.285053 -0.236236 0.190717 0.237721 0.187448 0.204181 0.243920 0.244021 0.262923 0.229977 0.218746 0.229963 0.326018 0.320993 0.225325 0.228678
chargesum: 0.00000
title: Mulliken charges with hydrogens summed into heavy atoms:
elementType: N N C C C C C C C C C C C C C C C
charge: -0.028756 -0.037450 0.332581 -0.305329 0.259614 0.265923 0.458728 -0.080988 -0.417954 0.457528 -0.349417 -0.163888 -0.114938 -0.066809 -0.141558 -0.059728 -0.007558
polarizability: 3.13257330e+02 1.95298003e+00 1.99451578e+02 2.12498610e-02 3.28261039e-02 7.78036000e+01
1716.lowfreq: -10.4888 -5.0235 -0.0008 -0.0005 -0.0004 5.7887 50.8341 78.0040 106.5712
frequency: 50.8300 78.0031 106.5676 125.9450 137.0361 181.6188 182.6688 200.7073 257.0470 271.7894 314.6661 348.0668 360.0866 368.3130 372.7585 412.0685 441.6091 470.6466 521.0871 524.1603 533.9100 542.4712 546.6315 592.6444 613.7990 634.5342 661.9041 737.5179 752.8792 757.9292 803.2460 828.7024 846.4318 866.2644 872.0698 892.9786 943.5160 945.6217 969.5379 990.2223 1014.8561 1020.6152 1027.2806 1044.7408 1052.4378 1105.6903 1129.6895 1163.9811 1169.2139 1217.0025 1249.8358 1267.1591 1277.1507 1303.7031 1351.3260 1378.9402 1396.3543 1398.6060 1406.6782 1426.2187 1445.0972 1447.9443 1453.8092 1465.4603 1475.1881 1480.9922 1493.9635 1532.1605 1554.9268 1566.1905 1618.5670 1636.7682 1651.3400 2970.1608 2986.4304 3045.4655 3070.3567 3080.4158 3088.9387 3099.3424 3104.4226 3113.2583 3132.6031 3151.4660 3167.8896 3579.6356 3713.0504
redmass: 3.7824 3.7146 1.0900 2.3522 1.2054 3.2926 3.7585 2.7729 2.6556 4.1185 3.8002 1.2067 4.4632 3.5430 4.2812 1.3997 2.8415 4.6089 3.4090 5.2749 5.3528 2.9235 5.7198 2.9150 4.6503 5.3000 4.6714 4.7675 2.0494 2.0298 2.0806 4.2117 1.8228 2.1597 5.8485 1.3347 2.2693 1.3697 4.6849 1.3266 1.7084 2.0633 1.7435 1.5315 1.6065 2.6959 1.6896 1.5328 1.3115 1.6217 2.5142 2.0703 2.4107 4.7447 2.2754 3.9585 1.2876 1.3665 2.8839 2.6656 2.3294 1.0465 2.8373 1.0457 1.3353 1.6260 2.7459 6.8880 6.2902 6.4374 6.0321 4.1811 1.3404 1.0373 1.0357 1.0973 1.0961 1.0985 1.1011 1.0896 1.0866 1.0913 1.0878 1.0941 1.0994 1.0451 1.1028
irintensity: 0.3107 0.5389 1.9080 8.4605 4.6992 0.0012 0.8129 0.1746 0.5694 0.2835 3.4837 0.1323 1.8752 4.4247 1.7968 199.8630 12.9829 0.5938 9.0764 1.7213 1.0243 1.8515 3.5404 16.6177 1.0786 4.6353 10.6521 0.3736 30.3936 75.8313 7.6508 0.7448 23.4576 0.0828 1.1854 3.5837 0.2552 1.3972 9.7017 0.5172 21.1909 5.8125 1.7509 0.8441 21.2716 14.2641 5.0400 0.6514 0.2471 1.9918 3.5570 0.0430 0.0783 26.6980 0.9743 16.5201 36.3178 0.1823 37.4705 6.3999 0.3453 12.6686 24.7674 12.3299 66.3474 45.4765 76.4742 45.3538 39.7927 11.9020 7.8824 10.5693 300.4230 54.0524 32.9978 21.1941 13.3927 15.3597 23.2636 31.0984 16.2295 30.6951 12.7713 27.4648 30.7359 56.3475 23.2393
temp: 298.150 k
press: 1.00000 atm
elementType: 7 7 6 6 6 6 6 6 6 6 6 6 6 6 6 6 6 1 1 1 1 1 1 1 1 1 1 1 1 1 1
symmnumber: 1
zpe: 655468.7 jmol-1
zpe.correction: 0.249655 hartree
zpe.thermalcorrener: 0.264308 hartree
zpe.thermalcorrenthalpy: 0.265252 hartree
zpe.thermalcorrgfe: 0.208819 hartree
zpe.sumelectzpe: -688.353824 hartree
zpe.sumelectthermal: -688.339171 hartree
zpe.sumelectthermalent: -688.338227 hartree
zpe.sumelectthermalfe: -688.394660 hartree
dipole: -0.4907 -4.0540 -0.0015
dipole: 4.0836
quadrupole: -83.6415 -83.9152 -106.4880
quadrupole: -2.2569 -0.0084 0.0187
quadrupole: 7.7067 7.4331 -15.1398 -2.2569 -0.0084 0.0187
hfenergy: -688.6034784 hartree
pointgroup: C01 [X(C15H14N2)]
dipole: 0.1835094 -1.5959181 0.0242245 debye
polarizability: 313.2273402|-2.6461249|199.4502185|-0.7280151|-1.8733395|77.8349494 unknown
InChI: InChI=1S/C15H14N2/c1-9-7-10(2)15-12(8-9)14(16)11-5-3-4-6-13(11)17-15/h3-8H,16H2,1-2H3
charge 0 multiplicity 1
31 atoms
N  -0.419615 1.464468 -0.020006
N  -0.476735 -2.814807 0.048379
C  0.78977 -0.715867 0.009877
C  0.743305 0.738575 -0.012401
C  -0.45766 -1.430956 0.025531
C  -1.687596 -0.683546 0.017053
C  1.993219 1.481728 -0.027471
C  -1.602113 0.768927 -0.005977
C  2.066867 -1.375254 0.015426
C  3.260713 -0.6554 -0.000455
C  3.198592 0.783331 -0.021405
C  -2.987054 -1.296754 0.029939
C  1.947226 2.993087 -0.049138
C  -2.822496 1.531592 -0.014487
C  4.612352 -1.344342 0.001297
C  -4.149713 -0.527055 0.021111
C  -4.065547 0.905009 -0.001293
H  2.132293 -2.471071 0.031228
H  4.140633 1.347118 -0.032783
H  -3.09287 -2.38906 0.04659
H  2.964182 3.422433 -0.056613
H  1.394344 3.35529 -0.934267
H  1.396226 3.380692 0.82632
H  -2.722352 2.621337 -0.031616
H  5.213205 -1.047079 0.882202
H  4.511293 -2.443259 0.016759
H  5.201915 -1.071593 -0.895294
H  0.384609 -3.351047 0.055198
H  -1.35232 -3.327362 0.060194
H  -5.130927 -1.014091 0.031143
H  -4.98485 1.501158 -0.007941
