program: Gaussian 09
title: 000038515
version: EM64L-G09RevD.01
frameworkgroup: C1[X(C12H14O3)]
method: RPBEPBE
basis: SDD
operation: Freq
keyword: #pfreq=noraman
keyword: PBEPBE/SDD
title: #p freq=noraman PBEPBE/SDD
converged: YES YES NO NO
title: Mulliken charges:
elementType: O O O C C C C C C C C C C C C H H H H H H H H H H H H H H
charge: -0.273557 -0.256794 -0.193537 -0.175368 0.514937 -0.696788 -0.368703 -0.453496 -0.582284 0.289074 -0.228133 -0.217487 -0.236755 0.224647 -0.754440 0.250246 0.229709 0.232755 0.244197 0.247118 0.234891 0.277905 0.237260 0.227546 0.228845 0.230739 0.251277 0.231831 0.284363
chargesum: 0.00000
title: Mulliken charges with hydrogens summed into heavy atoms:
elementType: O O O C C C C C C C C C C C C
charge: -0.273557 -0.256794 -0.193537 0.074878 0.514937 0.009874 -0.121584 -0.218605 -0.067120 0.289074 -0.000587 0.011359 -0.006015 0.224647 0.013031
polarizability: 1.69162894e+02 -1.86533734e+01 1.20103700e+02 1.13811332e+00 8.12096312e+00 1.21086187e+02
1716.lowfreq: -11.1563 -1.9877 -0.0004 0.0006 0.0008 6.1207 6.9641 26.0223 36.5603
frequency: 3.7805 25.8831 36.4617 49.2241 81.9833 102.4172 144.9721 158.7151 179.3505 226.6167 249.5828 254.8277 305.4941 347.2868 380.3866 401.8114 472.1542 479.1597 533.2908 533.8426 569.2776 592.0030 616.5030 698.5938 703.9433 764.6375 781.8436 788.7794 814.6497 853.1383 874.0451 919.1607 924.1733 976.2980 981.7136 992.0125 997.9141 1011.8119 1025.7254 1031.6539 1050.0905 1072.4040 1100.1063 1111.4483 1173.8663 1180.9459 1189.6177 1215.6354 1220.9656 1281.2835 1307.0645 1315.9341 1344.4652 1377.4269 1383.6307 1387.2495 1431.3014 1442.0943 1447.7151 1455.5018 1463.7540 1470.4639 1487.7394 1594.8618 1615.6360 1617.6246 1647.7792 2980.7245 2993.5124 3009.4753 3036.2787 3065.2495 3094.1613 3101.9915 3119.7643 3123.5815 3128.1818 3128.6497 3140.4159 3151.5280 3166.1814
redmass: 4.3962 4.0738 6.6275 5.5147 4.0845 4.3897 3.6094 1.1162 3.3027 1.4377 5.7491 2.0164 3.6890 3.7797 2.4540 2.8029 3.7194 3.6438 3.4990 3.1090 4.3550 3.8281 6.4096 5.1074 1.7757 2.0269 3.2475 3.2758 3.5857 1.2518 1.8799 2.1339 2.1157 1.3953 2.4335 4.4427 1.3700 1.9838 2.2144 1.8485 1.5973 1.8565 1.9904 1.9617 1.0560 2.1193 1.1474 1.7960 2.1142 1.4836 1.6973 1.2927 1.4637 1.2620 1.4298 3.6154 1.0875 2.1536 1.0609 1.0718 1.0842 1.0457 2.2605 6.2688 7.4825 7.2225 7.8124 1.0383 1.0349 1.0633 1.0861 1.0943 1.0992 1.1014 1.0870 1.0981 1.0866 1.1011 1.0916 1.0962 1.1016
irintensity: 1.5484 0.2684 2.2489 3.8724 2.4912 0.4104 2.1117 0.5613 4.2900 4.9802 3.6159 7.3096 0.4072 0.2713 5.4224 0.8423 4.7398 7.9978 3.4764 23.4637 21.2006 0.7818 0.5479 9.8224 49.6691 68.0797 0.7085 5.5585 1.5012 0.0551 20.6891 11.4202 30.6338 0.0912 25.0027 1.9495 0.2021 25.4885 42.2207 9.1543 151.7027 10.8722 228.8965 3.9890 1.1424 306.0055 14.5674 11.8045 59.8806 129.6147 9.8337 11.7993 4.5752 85.5534 17.5637 3.0401 15.9863 6.0436 34.3293 26.9295 2.1257 15.1838 11.5549 17.6261 128.3285 100.1434 101.8638 7.1484 13.3047 3.3823 5.3156 6.2982 23.3629 21.0074 6.6389 3.9313 0.0050 6.8887 17.7474 34.5311 18.4627
temp: 298.150 k
press: 1.00000 atm
elementType: 8 8 8 6 6 6 6 6 6 6 6 6 6 6 6 1 1 1 1 1 1 1 1 1 1 1 1 1 1
symmnumber: 1
zpe: 607173.1 jmol-1
zpe.correction: 0.231260 hartree
zpe.thermalcorrener: 0.246614 hartree
zpe.thermalcorrenthalpy: 0.247559 hartree
zpe.thermalcorrgfe: 0.184266 hartree
zpe.sumelectzpe: -690.238731 hartree
zpe.sumelectthermal: -690.223377 hartree
zpe.sumelectthermalent: -690.222433 hartree
zpe.sumelectthermalfe: -690.285726 hartree
dipole: 1.3722 2.3430 -0.9625
dipole: 2.8808
quadrupole: -78.2472 -98.0900 -82.1298
quadrupole: -9.3708 4.3295 -1.4011
quadrupole: 7.9085 -11.9343 4.0258 -9.3708 4.3295 -1.4011
hfenergy: -690.4699915 hartree
pointgroup: C01 [X(C12H14O3)]
dipole: -0.4603801 0.6393348 0.814793 debye
polarizability: 172.3659063|9.3142457|124.5604448|10.323185|-5.278438|113.4264303 unknown
InChI: InChI=1S/C12H14O3/c1-9(13)8-12(14)15-10(2)11-6-4-3-5-7-11/h3-7,10H,8H2,1-2H3
charge 0 multiplicity 1
29 atoms
O  0.493767 -0.277805 0.700173
O  2.279134 1.126696 0.156938
O  3.282412 -2.674868 -1.172679
C  -0.475579 0.877065 0.52229
C  -1.782698 0.278892 0.037218
C  -0.582313 1.612933 1.868579
C  -2.380078 -0.816437 0.711191
C  -2.44182 0.844593 -1.080826
C  2.680728 -1.254647 0.710225
C  1.839407 -0.001409 0.489719
C  -3.617886 -1.333601 0.272594
C  -3.686644 0.334185 -1.515098
C  -4.277802 -0.756655 -0.838759
C  3.532114 -1.624757 -0.530553
C  4.664281 -0.680735 -0.888888
H  -0.039315 1.549076 -0.23892
H  -0.929526 0.928001 2.661479
H  -1.31238 2.437461 1.784613
H  0.393992 2.038508 2.157097
H  -1.862905 -1.275331 1.560994
H  -1.980226 1.683411 -1.616525
H  2.029013 -2.102805 0.96448
H  3.368002 -1.044496 1.552523
H  -4.067596 -2.186601 0.793016
H  -4.187429 0.780091 -2.381552
H  -5.239304 -1.158749 -1.177028
H  5.098406 -0.955242 -1.862101
H  5.452491 -0.737338 -0.112412
H  4.301956 0.363163 -0.897285
