program: Gaussian 09
title: 000038594
version: EM64L-G09RevD.01
frameworkgroup: C1[X(C23H28FNO5)]
method: RPBEPBE
basis: SDD
operation: Freq
keyword: #p
keyword: freq=noraman
keyword: PBEPBE/SDD
title: #p freq=noraman PBEPBE/SDD
converged: YES YES NO NO
title: Mulliken charges:
elementType: F O O O O O N C C C C C C C C C C C C C C C C C C C C C C C H H H H H H H H H H H H H H H H H H H H H H H H H H H H
charge: -0.212269 -0.301893 -0.472107 -0.208993 -0.294789 -0.261571 -0.087117 -0.269072 0.413884 -0.454219 0.006778 -0.076048 -0.562462 0.258807 0.041843 0.033066 0.517317 -0.379760 -0.272795 -0.375244 -0.175421 -0.359653 -0.418268 -0.539270 -0.373659 -0.363860 -0.519426 0.309736 -0.622089 -0.614545 0.240471 0.271176 0.193983 0.236645 0.208138 0.275139 0.247654 0.235670 0.334475 0.191292 0.218982 0.265820 0.264652 0.237061 0.224740 0.221534 0.270245 0.251283 0.251183 0.255705 0.221257 0.230285 0.232643 0.227486 0.185191 0.229299 0.187875 0.223217
chargesum: 0.00000
title: Mulliken charges with hydrogens summed into heavy atoms:
elementType: F O O O O O N C C C C C C C C C C C C C C C C C C C C C C C
charge: -0.212269 -0.301893 -0.137632 -0.208993 -0.294789 -0.261571 -0.087117 -0.028601 0.413884 0.010940 0.006778 -0.076048 -0.117679 0.258807 0.041843 0.033066 0.517317 -0.104620 0.210529 0.035030 0.090399 -0.095000 -0.181207 0.177248 -0.122377 -0.112677 0.187821 0.309736 0.023231 0.025846
polarizability: 3.12044611e+02 -7.33758521e+00 3.09896026e+02 -3.52595484e+01 1.12286049e+01 2.17407726e+02
1716.lowfreq: -10.0249 -3.2008 -0.0005 -0.0002 0.0005 4.6891 5.2364 12.8929 16.8712
frequency: -6.0483 12.7281 16.6846 28.1885 33.8625 35.6383 49.0874 62.6640 65.1166 78.7409 82.4762 85.2651 88.0843 119.1286 138.6859 151.8204 156.1092 164.7303 174.9158 179.3981 191.5796 214.7381 225.3144 231.9204 234.9262 248.6584 262.8134 277.5091 288.5071 299.0550 318.0507 320.6396 328.2025 342.2191 353.4795 363.2970 395.8790 402.1751 413.1661 414.3203 439.3670 466.5166 471.7940 494.0178 519.6677 524.4767 549.2532 572.4342 577.2334 589.1202 629.5605 690.8363 709.7548 711.8670 739.9728 757.4323 760.7317 783.1539 797.6213 812.5508 817.6892 820.4981 821.9771 836.4932 845.1965 856.5777 872.6885 880.0737 906.6519 928.1594 936.6505 943.4953 967.0941 976.2378 1003.7119 1006.7874 1007.5118 1032.9910 1034.6433 1039.9226 1047.6932 1062.7057 1069.7991 1088.0121 1093.9812 1105.3555 1106.4786 1109.4726 1120.6738 1128.4732 1138.0806 1152.8708 1153.9412 1155.0691 1165.1768 1166.4088 1190.8874 1195.8328 1216.3663 1219.5008 1244.3284 1269.2923 1269.9453 1280.7471 1287.2723 1292.2100 1299.1680 1317.5290 1334.9557 1338.2628 1345.1220 1356.8499 1380.1297 1384.1431 1396.2635 1407.6471 1414.9648 1419.2922 1423.8499 1427.7444 1443.1006 1451.6147 1457.9615 1458.9123 1462.1413 1462.6811 1469.8116 1473.6529 1478.5533 1480.3042 1481.3861 1484.6322 1487.0182 1488.4127 1495.2122 1519.8180 1589.4308 1602.5778 1610.6052 1612.3401 2845.6807 2854.7140 2874.5888 2964.3000 2966.2192 2976.8311 2987.7604 2988.2479 2999.6360 3019.9062 3024.8836 3038.6911 3041.5136 3065.9383 3073.8128 3079.7520 3080.6529 3083.8261 3091.9208 3115.8572 3126.5185 3128.9655 3131.7593 3170.3054 3173.5760 3232.2500 3267.7848 3527.5928
redmass: 4.1338 5.6291 6.4590 4.0719 3.0296 3.7634 4.1235 5.3303 3.5534 3.3770 2.8201 3.2482 3.1643 2.8363 4.3049 3.5872 1.4265 4.0850 2.2426 1.4031 2.6778 2.8382 3.9700 3.4425 1.0711 1.4313 4.4833 4.2442 3.5100 3.5185 1.9245 2.5761 3.9483 5.5730 3.1421 5.0914 4.1030 4.1448 2.7186 2.9795 3.8211 4.3641 5.2755 4.5016 5.1298 6.0765 3.0784 4.6365 5.3594 5.7480 6.8940 7.0193 6.2897 3.9260 4.7829 2.5116 1.6476 1.8248 1.7298 5.0063 1.6826 2.3703 2.2280 1.8754 5.2875 3.9466 1.3708 4.8753 8.3511 5.9073 4.9947 1.5267 1.3394 3.9190 2.6619 4.4684 3.3295 3.2960 2.2222 1.6267 2.5020 1.5975 2.2391 2.0318 1.5790 1.9706 1.3761 1.5325 1.2431 1.9760 1.4248 1.3715 1.5308 1.3999 1.3153 1.3536 1.9175 1.8052 2.6126 2.0102 1.7361 1.3409 2.2131 1.2829 1.3227 2.4518 1.3017 2.0502 1.3426 1.6039 4.6342 1.3290 4.2124 6.3237 1.6710 2.7927 1.9433 1.4440 1.2243 1.2467 1.1539 1.6274 1.0590 1.0652 1.0611 1.3665 1.0711 1.0796 1.0542 1.0997 1.0653 1.0562 1.0572 1.0794 2.6313 5.6561 9.4699 7.5265 10.7231 6.4465 1.0572 1.0601 1.0668 1.0319 1.0683 1.0314 1.0695 1.0729 1.0566 1.0726 1.0721 1.0900 1.1000 1.1047 1.1076 1.1017 1.1025 1.1013 1.0930 1.1031 1.1036 1.0906 1.0900 1.0951 1.0958 1.0917 1.1081 1.0656
irintensity: 0.1143 0.1807 0.3080 0.0356 0.2398 0.0130 1.1402 0.2622 0.8350 7.6682 1.8369 3.1153 4.7628 0.8047 1.3572 4.9108 0.2057 1.8802 3.8067 2.6685 1.3614 5.9440 2.2492 7.6927 5.7910 2.4207 2.2827 4.8386 11.8736 20.6706 55.0798 44.4855 25.6312 8.1390 11.0708 7.3851 3.4941 2.0673 0.3530 0.0719 11.2894 21.7386 11.6271 8.2460 3.4255 2.9579 15.4863 10.1233 1.0114 3.4182 0.6264 12.2015 3.8158 2.8587 31.3207 5.4147 56.6543 29.5843 6.8146 10.1734 24.7308 3.7317 6.4518 39.5258 20.6125 30.1638 8.6764 15.1870 17.8609 92.9534 14.9849 12.0160 0.1996 29.9669 39.6204 132.8174 96.6848 10.3766 28.9250 32.4821 73.6184 10.3825 35.7424 6.2339 9.8551 18.0982 18.9452 5.7026 3.8484 36.0866 5.2424 0.6066 47.0430 0.9179 8.3944 7.3691 107.0584 40.9280 12.6361 42.9067 3.1281 3.9715 10.4955 22.7880 2.4533 18.7523 2.8188 114.7719 3.4824 8.6232 51.9976 4.1273 8.2696 0.6780 3.5555 0.9599 25.1252 18.9565 7.9901 18.7302 3.1323 80.6758 4.5238 10.2101 6.2416 50.2519 6.2847 7.8696 18.9613 13.3880 5.8964 10.2753 12.8846 18.1816 129.8085 7.6034 6.3914 5.1371 20.0014 8.4123 67.0685 143.3776 157.0666 66.9420 41.1923 72.1550 20.9564 26.1492 23.6935 40.1515 51.4209 10.2353 15.5783 17.8963 9.9948 42.5658 21.8666 46.9358 11.6418 23.6940 21.2620 5.5338 11.2984 4.8299 5.0753 2.0604 0.2420 6.5743
temp: 298.150 k
press: 1.00000 atm
elementType: 9 8 8 8 8 8 7 6 6 6 6 6 6 6 6 6 6 6 6 6 6 6 6 6 6 6 6 6 6 6 1 1 1 1 1 1 1 1 1 1 1 1 1 1 1 1 1 1 1 1 1 1 1 1 1 1 1 1
symmnumber: 1
zpe: 1223195.6 jmol-1
zpe.correction: 0.465891 hartree
zpe.thermalcorrener: 0.496371 hartree
zpe.thermalcorrenthalpy: 0.497315 hartree
zpe.thermalcorrgfe: 0.401414 hartree
zpe.sumelectzpe: -1421.609694 hartree
zpe.sumelectthermal: -1421.579214 hartree
zpe.sumelectthermalent: -1421.578269 hartree
zpe.sumelectthermalfe: -1421.674171 hartree
dipole: 2.0291 -2.2247 0.7396
dipole: 3.1005
quadrupole: -208.8856 -157.4766 -165.2851
quadrupole: -16.1283 -8.9451 5.2691
quadrupole: -31.6699 19.7392 11.9307 -16.1283 -8.9451 5.2691
hfenergy: -1422.0755849 hartree
pointgroup: C01 [X(C23H28F1N1O5)]
dipole: -0.738036 -0.9016816 -0.3609707 debye
polarizability: 305.8206279|11.5347182|313.4385194|-38.9081543|-2.8989126|220.0892164 unknown
InChI: InChI=1S/C23H28FNO5/c1-25(2)12-14-30-22-19(18(26)10-7-15-5-8-16(24)9-6-15)20(27-3)17-11-13-29-21(17)23(22)28-4/h5-6,8-9,11,13,18,26H,7,10,12,14H2,1-4H3
charge 0 multiplicity 1
58 atoms
F  7.839092 -0.71115 -0.059087
O  -2.295493 -0.931247 1.001804
O  -0.712529 -1.193456 -2.167604
O  -2.13145 3.993523 1.258753
O  0.894198 1.779906 -1.643039
O  -3.419784 1.462831 2.082606
N  -4.626926 -3.429052 -0.552002
C  -0.110186 -0.9563 -0.812335
C  -0.661523 0.369794 -0.308194
C  1.428305 -1.070498 -0.885002
C  -1.747674 0.323692 0.632336
C  -0.164952 1.636293 -0.71188
C  2.119947 -0.824603 0.483367
C  -0.708875 2.813868 -0.140928
C  -2.311911 1.486157 1.22507
C  -1.752823 2.711803 0.817681
C  3.636459 -0.802983 0.361553
C  -0.431292 4.232643 -0.294187
C  -3.370156 -1.388389 0.061514
C  -3.718808 -2.830336 0.452221
C  -1.294483 4.896657 0.549982
C  4.277537 0.28482 -0.290887
C  4.438195 -1.855857 0.869632
C  0.446326 1.770863 -3.059921
C  5.680689 0.326157 -0.435938
C  5.846249 -1.83849 0.734434
C  -3.222755 0.748618 3.366964
C  6.43303 -0.743125 0.081435
C  -3.926322 -3.894363 -1.766029
C  -5.519444 -4.463633 0.004737
H  -0.489294 -1.742566 -0.129055
H  1.81745 -0.35066 -1.622061
H  1.687494 -2.091608 -1.237595
H  1.764879 0.145364 0.880487
H  1.803693 -1.601794 1.20578
H  0.32224 4.680362 -0.937498
H  -2.978366 -1.324985 -0.970404
H  -4.246805 -0.723958 0.166557
H  -0.317365 -2.030079 -2.528354
H  -2.771388 -3.412135 0.578773
H  -4.225928 -2.824102 1.433976
H  -1.460598 5.945249 0.781105
H  3.66776 1.107801 -0.683541
H  3.960494 -2.7005 1.379925
H  1.363176 1.882776 -3.659507
H  -0.234753 2.622648 -3.249508
H  -0.061784 0.816286 -3.287221
H  6.185404 1.161178 -0.930854
H  6.473711 -2.645262 1.124476
H  -2.939404 -0.302294 3.186137
H  -2.448455 1.26067 3.968989
H  -4.195152 0.808629 3.878543
H  -3.307568 -3.083718 -2.188384
H  -4.666748 -4.187174 -2.531816
H  -3.260179 -4.774748 -1.573039
H  -6.095918 -4.046681 0.84913
H  -4.978189 -5.374501 0.367963
H  -6.238149 -4.78584 -0.770459
