program: Gaussian 09
title: 000038522
version: EM64L-G09RevD.01
frameworkgroup: C1[X(C22H22O4)]
method: RPBEPBE
basis: SDD
operation: Freq
keyword: #pfreq=noraman
keyword: PBEPBE/SDD
title: #p freq=noraman PBEPBE/SDD
converged: YES YES NO NO
title: Mulliken charges:
elementType: O O O O C C C C C C C C C C C C C C C C C C C C C C H H H H H H H H H H H H H H H H H H H H H H
charge: -0.257564 -0.147411 -0.242647 -0.218281 0.096973 0.154830 0.006100 0.308301 0.250617 0.319554 0.357950 -0.231921 0.484227 -0.624536 -0.628512 -0.427809 -0.413027 -0.859253 -0.866913 -0.217516 -0.228211 -0.819513 0.289260 0.026541 -0.678471 -0.682018 0.235518 0.235220 0.270303 0.278753 0.257984 0.234131 0.229300 0.251642 0.221351 0.265785 0.232488 0.235237 0.226332 0.230077 0.224305 0.242020 0.219657 0.253737 0.225921 0.211804 0.239846 0.227834
chargesum: 0.00000
title: Mulliken charges with hydrogens summed into heavy atoms:
elementType: O O O O C C C C C C C C C C C C C C C C C C C C C C
charge: -0.257564 -0.147411 -0.242647 -0.218281 0.096973 0.154830 0.006100 0.308301 0.250617 0.319554 0.357950 -0.231921 0.484227 -0.389017 -0.393291 -0.157506 -0.134275 -0.137837 -0.128135 0.014972 0.007026 -0.138800 0.289260 0.268561 0.020845 -0.002533
polarizability: 3.50439410e+02 -3.62957187e+01 2.58571133e+02 5.01774419e+00 1.96485216e+01 1.83535192e+02
1716.lowfreq: -29.9742 -12.1758 -4.3235 0.0002 0.0004 0.0004 1.1095 6.3998 24.6449
frequency: -29.8330 -7.8259 24.1147 34.7840 40.8986 49.1408 56.9751 90.8601 95.2321 122.1630 134.1353 135.2345 140.0016 154.3269 177.0827 183.7281 189.4102 193.9321 207.5484 216.5004 230.3245 238.8474 271.4494 276.0329 305.8188 330.7743 341.6172 373.3193 382.2869 394.5717 421.7168 445.9532 452.9743 500.8529 522.1097 524.8732 536.0977 547.2298 559.8965 565.8067 587.7057 603.4162 646.9412 669.3125 675.5019 699.6579 730.5478 748.1396 773.8832 786.2206 812.0231 816.0677 860.6017 869.4738 877.4458 892.6210 902.2751 925.5972 929.0764 936.3018 942.2309 954.6231 963.8945 995.2942 1005.9593 1016.6630 1019.9416 1037.2408 1043.1805 1046.8613 1049.9348 1052.6263 1064.2803 1083.5664 1099.4433 1128.9117 1159.0936 1161.7470 1174.6619 1176.5516 1188.1093 1232.6539 1252.8818 1285.5355 1310.0821 1319.0934 1330.0528 1334.6873 1355.5772 1383.9157 1392.9908 1396.1355 1398.6734 1402.5988 1415.1091 1421.1215 1441.0969 1448.9060 1456.5089 1461.4321 1464.5660 1470.4493 1471.9452 1472.7528 1472.9213 1473.6083 1485.1737 1486.3037 1495.3818 1574.3091 1593.9782 1606.2892 1618.6649 1619.9574 1630.8721 1657.5023 2971.7219 2977.0491 2981.3060 2992.4186 2997.1386 3031.3187 3052.7815 3055.8043 3068.0639 3081.5670 3082.9008 3083.3217 3088.5311 3097.9839 3102.3772 3107.6615 3111.5947 3116.4881 3134.7721 3148.8347 3159.9833 3170.8553
redmass: 1.0139 3.3876 3.4487 3.8166 4.7272 4.8201 4.6715 4.2152 8.3617 2.9466 2.2903 3.5367 1.5793 1.5359 4.2612 4.4020 1.0347 2.5715 4.6358 3.6677 2.5475 1.3203 2.6848 4.0492 4.5007 3.9536 4.7790 3.7517 4.0329 3.1439 3.7069 2.9837 4.2217 3.6791 6.1575 3.1157 6.3247 4.2690 4.0204 4.2586 5.6453 6.1683 6.1081 6.4113 9.1975 7.3766 2.6660 3.0680 2.4538 3.9718 3.7148 5.3239 1.9082 2.6921 3.6893 1.3168 1.4369 4.0145 1.2306 2.4504 1.4130 3.5024 1.4345 1.3484 2.7185 1.6263 1.6564 1.9940 1.6980 2.3002 1.8644 1.7286 3.0081 2.1905 2.8192 3.3154 1.9995 1.8089 1.5968 1.4845 1.9714 2.5920 1.4420 1.6190 5.4337 5.4186 1.4380 1.3956 6.9423 1.2604 1.2659 1.2380 1.2252 1.2947 2.3549 3.7850 2.3919 2.2997 1.0523 3.4367 1.0517 1.0657 1.0719 1.0546 1.0552 1.0898 1.1367 1.0605 1.3542 6.9954 9.3285 9.0591 6.3249 7.8357 9.9596 11.7570 1.0389 1.0372 1.0362 1.0357 1.0359 1.0871 1.0945 1.0972 1.0979 1.0990 1.0997 1.0993 1.0992 1.0990 1.1011 1.1008 1.0909 1.0917 1.0859 1.0907 1.0950 1.1001
irintensity: 0.3161 0.1808 0.1176 0.1377 1.3337 0.8854 1.1312 0.8451 1.2122 2.2859 1.8071 0.5236 1.6617 1.4297 0.3834 0.1502 0.0170 3.8484 0.7202 1.2081 0.0750 1.0508 1.2363 5.5327 10.3580 8.8964 0.5650 2.0689 1.1818 6.4065 2.2742 2.5451 6.3465 0.1465 3.4901 1.7517 6.8565 2.4745 4.4638 0.8591 2.6921 5.7127 14.5443 19.2573 4.2016 7.5266 28.0945 17.7556 52.8150 7.0020 8.7301 33.6024 12.3862 28.2867 55.9068 0.0189 0.2597 3.0353 2.1650 2.9066 2.3998 5.4271 3.7504 0.0214 40.7061 1.3428 8.2753 57.6383 40.2237 259.0970 70.0787 7.5641 28.1541 391.1342 135.8032 613.5518 16.6207 39.5448 4.5957 7.5978 14.3929 8.0979 0.5093 7.2425 80.0598 17.3575 18.1722 3.9584 1.2838 36.9517 24.0360 10.7125 22.6593 10.6564 2.0606 21.0951 15.3074 25.7758 6.5124 18.2412 3.6501 12.7917 7.8911 7.5580 5.1750 16.4025 17.2314 29.5321 33.1637 18.7047 97.7771 80.6044 22.2873 13.0684 40.1296 176.2975 47.0829 24.0635 19.9195 12.3139 17.6303 4.4282 23.3064 12.8224 6.7634 19.9130 13.7675 29.1623 6.8379 35.1151 11.7069 32.6262 28.8593 23.3301 2.3175 7.9330 12.6238 26.5252
temp: 298.150 k
press: 1.00000 atm
elementType: 8 8 8 8 6 6 6 6 6 6 6 6 6 6 6 6 6 6 6 6 6 6 6 6 6 6 1 1 1 1 1 1 1 1 1 1 1 1 1 1 1 1 1 1 1 1 1 1
symmnumber: 1
zpe: 997831.8 jmol-1
zpe.correction: 0.380054 hartree
zpe.thermalcorrener: 0.404308 hartree
zpe.thermalcorrenthalpy: 0.405252 hartree
zpe.thermalcorrgfe: 0.325879 hartree
zpe.sumelectzpe: -1150.579296 hartree
zpe.sumelectthermal: -1150.555042 hartree
zpe.sumelectthermalent: -1150.554098 hartree
zpe.sumelectthermalfe: -1150.633471 hartree
dipole: 1.8596 4.4608 0.3741
dipole: 4.8474
quadrupole: -122.2800 -149.1669 -152.7200
quadrupole: -2.8682 -0.4089 -0.7405
quadrupole: 19.1090 -7.7779 -11.3310 -2.8682 -0.4089 -0.7405
hfenergy: -1150.9593501 hartree
pointgroup: C01 [X(C22H22O4)]
dipole: -1.0413734 -1.5164828 -0.502888 debye
polarizability: 313.1695622|-61.900612|285.9130155|22.7840662|20.714741|193.4631568 unknown
InChI: InChI=1S/C22H22O4/c1-12(2)25-22(24)26-21-17-9-7-6-8-16(17)20(23)19(21)18-14(4)10-13(3)11-15(18)5/h6-12H,1-5H3
charge 0 multiplicity 1
48 atoms
O  -1.609758 -0.452825 -0.70351
O  0.989091 3.330926 0.941086
O  -1.434156 -2.662911 -0.88719
O  -0.914902 -1.69234 1.191445
C  0.109629 1.136744 0.176655
C  1.349129 0.323758 0.182988
C  -1.161974 0.785238 -0.225857
C  -2.109999 1.924662 -0.189863
C  -1.385108 3.050954 0.288004
C  1.889436 -0.16103 -1.050043
C  2.021336 0.050298 1.413798
C  0.038966 2.608066 0.537568
C  3.779712 -1.179295 0.181439
C  3.09641 -0.900539 -1.026027
C  3.223271 -0.693305 1.389002
C  -3.468809 2.021119 -0.513675
C  -1.999513 4.29469 0.454305
C  1.219093 0.127448 -2.384595
C  1.44378 0.512071 2.73844
C  -4.100531 3.289348 -0.352512
C  -3.381979 4.408309 0.123337
C  5.062675 -1.992775 0.183562
C  -1.260311 -1.637313 -0.000942
C  -1.197539 -4.061043 -0.334164
C  -2.443137 -4.499896 0.4447
C  -0.88587 -4.911409 -1.564706
H  3.518277 -1.25459 -1.975489
H  3.735028 -0.900741 2.337345
H  -4.027507 1.156074 -0.883503
H  -1.430544 5.152378 0.8277
H  0.258898 -0.411769 -2.490222
H  0.998458 1.204088 -2.504759
H  1.868978 -0.180315 -3.221524
H  0.39789 0.170207 2.846687
H  2.025632 0.109529 3.585144
H  1.450247 1.614406 2.815084
H  -5.161634 3.397262 -0.602877
H  -3.891837 5.370826 0.237783
H  5.712244 -1.720336 1.033982
H  4.849125 -3.076587 0.26804
H  5.637545 -1.844048 -0.747707
H  -0.324556 -3.986104 0.340587
H  -2.299279 -5.527492 0.825196
H  -2.622975 -3.838849 1.309032
H  -3.332693 -4.493369 -0.209238
H  -0.667072 -5.948566 -1.253478
H  -0.009156 -4.515083 -2.10378
H  -1.746014 -4.927772 -2.25625
