program: Gaussian 16
title: hf2c60
version: EM64L-G16RevB.01
basis: def2SVP
frameworkgroup: C1[X(C60H2F2)]
method: RPBEPBE
operation: FOpt
keyword: #p
keyword: opt
keyword: pbepbe
keyword: def2svp
keyword: scf=xqc
title: #p opt pbepbe def2svp scf=xqc
nucrepener: 9404.2744714957
basis: NPDir=0 NMtPBC= 1 NCelOv= 1 NCel= 1 NClECP= 1 NCelD= 1
basis: NCelK= 1 NCelE2= 1 NClLst= 1 CellRange= 0.0.
basis: One-electron integrals computed using PRISM.
basis: One-electron integral symmetry used in STVInt
converged: YES YES YES YES
title: Mulliken charges:
elementType: C C C C C C C C C C C C C C C C C C C C C C C C C C C C C C C C C C C C C C C C C C C C C C C C C C C C C C C C C C C C F H F H
charge: 0.007261 -0.006433 -0.006518 -0.000052 0.000157 0.002438 -0.011182 -0.009550 0.000184 0.000596 0.007257 -0.010526 -0.017001 0.002921 0.014750 0.005894 0.001149 0.001637 -0.011435 -0.016106 -0.029050 -0.012692 -0.011906 0.001620 0.001078 0.005481 0.014762 0.003249 -0.011701 -0.011176 -0.011410 0.001796 0.001123 0.002547 -0.006387 0.000197 -0.009675 -0.016239 -0.029670 -0.012852 0.001732 0.001095 0.005556 0.005940 0.014746 0.000103 -0.000002 -0.006581 0.000503 0.002332 0.007228 -0.011701 -0.010452 -0.016797 0.003148 0.003582 0.014602 -0.011866 0.002396 0.007280 -0.169233 0.250180 -0.168657 0.250335
chargesum: -0.00000
charge: 0.007134 -0.006316 -0.006900 -0.000114 0.000143 0.001763 -0.010650 -0.009672 -0.000257 0.001032 0.007252 -0.011340 -0.016347 0.003254 0.014513 0.005870 0.001735 0.001230 -0.011949 -0.016010 -0.027605 -0.011120 -0.012515 0.001375 0.001429 0.005407 0.014313 0.004072 -0.011392 -0.010584 -0.011927 0.001190 0.001672 0.001943 -0.006249 -0.000143 -0.009820 -0.015596 -0.027765 -0.011020 0.001481 0.001111 0.005831 0.005716 0.014753 -0.000151 -0.000004 -0.006992 0.000859 0.001515 0.007358 -0.011456 -0.011285 -0.016517 0.003165 0.004394 0.013848 -0.012588 0.001650 0.007077 -0.169022 0.249223 -0.169179 0.249179
dipole: -0.0017 -0.0002 0.0006
dipole: 0.0019
quadrupole: -345.2206 -343.7046 -343.1643
quadrupole: -0.0360 -0.1774 0.1129
quadrupole: -1.1908 0.3252 0.8656 -0.0360 -0.1774 0.1129
hfenergy: -2482.4811927 hartree
pointgroup: C01 [X(C60H2F2)]
dipole: -0.000688 -0.0001202 0.0002169 debye
InChI: InChI=1S/C60.2FH/c1-2-5-6-3(1)8-12-10-4(1)9-11-7(2)17-21-13(5)23-24-14(6)22-18(8)28-20(12)30-26-16(10)15(9)25-29-19(11)27(17)37-41-31(21)33(23)43-44-34(24)32(22)42-38(28)48-40(30)46-36(26)35(25)45-39(29)47(37)55-49(41)51(43)57-52(44)50(42)56(48)59-54(46)53(45)58(55)60(57)59;;/h;2*1H
charge 0 multiplicity 1
64 atoms
C  0.69196533 -3.04828489 1.68547403
C  -0.2143661 -3.48898508 0.63377387
C  0.21920111 -3.47604671 -0.70077572
C  1.56928085 -3.02547861 -1.02727982
C  2.45184643 -2.60443972 -0.01304446
C  1.99689112 -2.61363354 1.37115379
C  -0.10247416 -2.33375686 2.67462055
C  -1.49520143 -2.3305474 2.23336076
C  -1.564857 -3.04634759 0.9689081
C  -2.44803879 -2.60717694 -0.03699734
C  -0.68773018 -3.01644696 -1.74385115
C  1.49848168 -2.28534731 -2.27766335
C  2.31411158 -1.15263399 -2.46737316
C  3.24030946 -0.7161812 -1.42182499
C  3.30943499 -1.434898 -0.20779289
C  3.38010349 -0.71484111 1.0652216
C  2.5652617 -1.44718937 2.0358405
C  1.79138023 -0.7553949 2.98811367
C  0.44023971 -1.20619861 3.31233392
C  -2.31225373 -1.20277447 2.44454544
C  -1.74468685 -0.03088285 3.1001805
C  -0.39803983 -0.0340235 3.52542749
C  0.43869439 1.14309461 3.33493661
C  1.79046167 0.70021225 3.00212904
C  2.5631256 1.41109965 2.06311096
C  3.37892544 0.69860422 1.07863974
C  3.30725783 1.44287045 -0.18028811
C  3.23925829 0.7476255 -1.40787125
C  0.10569706 -2.28186588 -2.7189574
C  0.10259091 2.33380579 -2.67474285
C  -0.4401274 1.20624327 -3.31242996
C  -1.79125655 0.75542702 -2.98816885
C  -2.56512001 1.44716703 -2.03585026
C  -1.99672461 2.61357452 -1.37120068
C  0.21449603 3.48901037 -0.63388349
C  1.56498958 3.04637397 -0.96902448
C  1.49532109 2.33060232 -2.23350806
C  2.31238686 1.20284649 -2.4447797
C  1.74480564 0.0309129 -3.1003861
C  0.39814401 0.03406601 -3.5255652
C  -1.79034189 -0.70016514 -3.00220332
C  -2.56296445 -1.41098536 -2.06313396
C  -3.37898231 -0.69854593 -1.07871001
C  -3.38011326 0.71488097 -1.06524481
C  -3.30951477 1.43491985 0.20772709
C  -2.45162931 2.60429235 0.01297751
C  -1.56914745 3.02547942 1.02718509
C  -0.21907724 3.4760606 0.70065936
C  2.44821255 2.60725428 0.03688157
C  1.99325076 2.58941088 1.42100225
C  0.68785748 3.01649738 1.74374445
C  -0.10557279 2.28188331 2.71883436
C  -1.49835979 2.28534569 2.2775388
C  -2.31397565 1.15261931 2.46715032
C  -3.24043497 0.71622397 1.42173923
C  -3.23937109 -0.74757634 1.40776695
C  -3.30702143 -1.4427508 0.18016769
C  -0.43857795 -1.14305878 -3.33502966
C  -1.99311563 -2.58933354 -1.42110698
C  -0.69183252 3.04829416 -1.6855655
F  -1.10346669 0.00072998 -0.03565221
H  -0.49925785 0.0103336 0.69449214
F  1.10476514 -0.00079891 0.03486195
H  0.49921272 -0.0110338 -0.69417262
