program: Gaussian 16
title: Title Card Required
version: ES64L-G16RevC.01
frameworkgroup: C1[X(C19H24CoN3O4Si)]
method: UB3LYP
basis: Gen
operation: Freq
keyword: #p
keyword: freq=noraman
keyword: b3lyp/gen
keyword: empiricaldispersion=gd3
keyword: scrf=(solvent=methanol)
keyword: integral=grid=ultrafine
keyword: pseudo=read
keyword: scf=(intrep,xqc,maxconventionalcycles=200)
title: #p freq=noraman b3lyp/gen empiricaldispersion=gd3 scrf=(solvent=methan
basis: NPDir=0 NMtPBC= 1 NCelOv= 1 NCel= 1 NClECP= 1 NCelD= 1
basis: NCelK= 1 NCelE2= 1 NClLst= 1 CellRange= 0.0.
basis: One-electron integrals computed using PRISM.
basis: One-electron integral symmetry used in STVInt
converged: YES YES NO YES
polarizability: 4.90883019e+02 -3.01004772e-01 4.04685107e+02 -1.98016801e+00 9.04272244e+01 2.54901302e+02
1716.lowfreq: -5.2200 -0.0019 -0.0013 -0.0012 3.0761 9.9507 23.7261 30.3524 33.4442
frequency: 23.6974 29.8916 33.4070 42.0046 47.6802 56.9256 57.6118 67.5984 69.2335 75.7180 77.4773 84.0001 89.7484 99.0636 99.7812 102.5454 113.7219 118.6320 121.9092 125.5712 131.4032 139.1952 158.9718 183.0633 192.8017 208.5269 217.5667 222.9986 247.6444 262.8459 273.0683 319.6171 323.3623 355.9574 360.9097 413.8762 421.4282 431.7594 442.0897 447.0891 462.4260 519.5322 527.4913 540.8969 643.0193 646.3312 656.8178 663.8093 675.9145 681.2929 738.5004 743.8170 753.4109 760.8495 767.5466 784.8820 809.9122 810.6787 845.2933 848.8337 852.4608 911.7185 914.3629 923.8592 926.1481 994.6693 997.0505 1018.2161 1025.7609 1027.2149 1030.0947 1036.8406 1044.3183 1058.8255 1075.3955 1076.1330 1083.0300 1099.6713 1100.0845 1111.2627 1124.4103 1126.2875 1142.0332 1167.5039 1168.7770 1181.0321 1182.2300 1182.5052 1186.5971 1193.3138 1197.2712 1206.0960 1208.3907 1209.1423 1220.4794 1303.6109 1311.2230 1317.7222 1321.8010 1332.9390 1361.1093 1367.2529 1443.9636 1478.3029 1481.0054 1488.3839 1489.4385 1489.4744 1490.8222 1492.4968 1495.3140 1496.5456 1498.0808 1498.9821 1501.2474 1501.7312 1502.2877 1503.6962 1515.2555 1533.9576 1616.6382 1624.2583 1632.1636 1644.3531 1650.4843 1656.5948 2218.7609 2950.5389 2994.0994 3029.6446 3033.3765 3041.5034 3043.2777 3106.1629 3117.8564 3118.8135 3138.3050 3142.0242 3146.5416 3213.6738 3215.2157 3218.1412 3219.5477 3220.5970 3233.2555 3234.7113 3238.0771 3239.3120 3244.9356 3247.5358
redmass: 3.9071 4.7368 4.0419 5.1336 3.7795 2.4033 2.8624 3.6255 1.9160 3.6761 3.2784 2.6148 2.5965 2.0506 1.4518 2.5850 6.1994 2.8170 3.6975 1.1585 2.0492 3.2769 4.6868 4.8985 8.6935 3.7245 8.8510 4.1877 5.8867 6.8264 5.8937 6.9019 6.9267 6.6022 5.9397 3.3464 3.4412 8.0096 6.4841 4.1101 3.7826 9.1750 3.1910 5.3763 7.5129 3.7169 7.0826 7.4119 7.0971 6.9491 5.7794 1.8427 4.2826 1.7715 1.7772 1.1955 4.4578 2.5219 2.7871 3.2021 3.2986 1.3683 1.3704 1.1641 1.3836 1.3890 1.3856 1.3393 1.3289 1.3265 7.6557 7.6853 7.6495 4.7483 2.6265 6.4840 6.8429 2.6150 4.3435 5.8583 1.7439 1.5986 1.6612 1.3404 1.6801 1.2563 1.2606 1.2571 1.3211 1.1470 1.1331 1.4064 1.3946 1.4150 1.2794 2.4581 2.7569 5.7321 1.5480 2.1784 3.2871 4.3442 2.3857 2.2363 1.1330 1.1898 1.3954 1.3801 1.1294 1.0775 1.0873 1.0555 1.0527 2.1856 1.0563 1.1241 1.0493 1.0477 2.6352 2.9889 5.8857 5.6401 6.6653 5.1564 5.5965 6.4613 1.0370 1.0317 1.1034 1.0999 1.0322 1.0298 1.0310 1.1062 1.1061 1.1075 1.1063 1.1048 1.1059 1.0891 1.0892 1.0917 1.0915 1.0907 1.0939 1.0942 1.0982 1.0985 1.0925 1.0954
irintensity: 0.5176 0.2994 1.1960 3.9203 2.4768 3.0648 0.0420 1.5736 5.6894 5.3709 0.0675 2.4800 2.2320 6.0557 4.4656 1.1314 30.1201 1.3334 7.2680 0.4433 4.0027 11.8863 13.4242 5.0990 7.2737 11.1849 19.8251 1.0171 2.1773 15.1281 28.5215 12.9070 23.7221 0.5122 23.9064 11.8256 0.5745 97.0569 2.0357 9.8506 0.1396 200.5882 4.6765 0.0652 5.8033 0.3533 17.2419 25.0134 17.5962 64.2882 1.0666 9.5377 17.6290 4.4283 18.1199 184.3592 92.1128 24.9637 3.2029 157.9266 155.5516 3.0385 2.0457 344.5567 0.4505 1.0309 0.8978 0.1283 0.0704 0.1684 0.7273 39.7175 15.3447 0.9643 28.4324 188.8634 522.0282 119.7814 338.9788 193.3810 7.0686 9.1639 1.4822 0.2938 0.0293 0.1636 0.1371 0.5253 23.4636 8.3080 16.3946 54.2435 63.6100 37.7742 21.2145 3.4587 30.6547 21.2191 0.6781 50.4072 0.1892 28.5457 11.2457 8.8743 40.9921 19.8626 77.8850 63.5139 8.4108 18.4202 0.6483 4.9569 5.9262 4.3746 7.1249 18.3869 8.0129 7.6785 100.1271 9.7249 26.4926 44.0357 83.5805 53.9577 96.6144 5.9757 435.7287 175.6251 107.8314 125.3867 76.7302 71.1955 48.6540 37.7310 34.1732 41.2773 32.0703 30.0803 28.1823 9.2204 8.8097 1.4831 0.1087 9.3869 2.7254 4.8113 6.9758 3.6028 5.2744 3.6205
temp: 298.150 k
press: 1.00000 atm
elementType: 27 6 6 6 6 6 7 1 1 1 1 6 6 7 6 1 6 6 1 1 6 6 7 6 1 6 6 1 1 1 6 1 1 1 8 14 1 8 8 8 6 1 1 1 6 1 1 1 6 1 1 1
symmnumber: 1
zpe: 1075573.7 jmol-1
zpe.correction: 0.409664 hartree
zpe.thermalcorrener: 0.440816 hartree
zpe.thermalcorrenthalpy: 0.441761 hartree
zpe.thermalcorrgfe: 0.342612 hartree
zpe.sumelectzpe: -1638.718521 hartree
zpe.sumelectthermal: -1638.687369 hartree
zpe.sumelectthermalent: -1638.686425 hartree
zpe.sumelectthermalfe: -1638.785574 hartree
dipole: -0.3424 6.5799 2.0790
dipole: 6.9091
quadrupole: -93.8487 -133.5450 -178.3951
quadrupole: -0.4755 1.0874 3.4186
quadrupole: 41.4142 1.7180 -43.1322 -0.4755 1.0874 3.4186
hfenergy: -1639.1281858 hartree
pointgroup: C01 [X(C19H24Co1N3O4Si1)]
dipole: -0.1347223 2.5887468 0.817958 debye
polarizability: 490.8830188|-0.3010099|404.6851075|-1.9801626|90.4272245|254.9013024 unknown
InChI: InChI=1S/C15H11N3.C3H10O3Si.CH3O.Co/c1-3-10-16-12(6-1)14-8-5-9-15(18-14)13-7-2-4-11-17-13;1-4-7(5-2)6-3;1-2;/h1-11H;7H,1-3H3;1H3;/q-3;;-1;+4
charge 1 multiplicity 4
52 atoms
Co -0.018496 -0.444893 -1.494524
C  -3.068912 -0.848182 -1.459099
C  -4.409297 -0.539887 -1.232014
C  -4.717029 0.687314 -0.646097
C  -3.685359 1.561858 -0.303262
C  -2.366562 1.182163 -0.555105
N  -2.078556 -0.010427 -1.126587
H  -5.748218 0.9640 -0.454582
H  -2.756695 -1.781761 -1.915185
H  -5.183438 -1.245694 -1.509058
H  -3.909803 2.517662 0.153633
C  -1.179384 2.000954 -0.205033
C  -1.210203 3.22569 0.466882
N  -0.011218 1.441524 -0.555915
C  0.002293 3.841653 0.775767
H  -2.146895 3.685665 0.75479
C  1.164749 2.007064 -0.241651
C  1.208116 3.231415 0.430497
H  0.008068 4.791523 1.299146
H  2.150386 3.697067 0.689457
C  2.345409 1.195395 -0.62733
C  3.666781 1.56972 -0.382639
N  2.049429 0.015803 -1.219527
C  4.693602 0.698839 -0.749495
H  3.897543 2.51732 0.088132
C  3.034367 -0.817027 -1.575653
C  4.377546 -0.516568 -1.354596
H  5.727256 0.970268 -0.563292
H  2.717698 -1.742302 -2.045583
H  5.14744 -1.218809 -1.652085
C  -0.015113 -3.279227 -1.900382
H  0.916152 -3.448282 -1.334129
H  -0.080487 -4.060802 -2.671015
H  -0.853175 -3.430807 -1.199867
O  -0.045825 -1.998996 -2.492498
Si 0.057953 -1.144599 1.743898
H  0.025463 -1.505494 0.303497
O  -1.202759 -0.190956 2.192968
O  1.446947 -0.289069 1.924722
O  -0.02939 -2.547045 2.60867
C  -2.556594 -0.639877 2.357598
H  -3.162141 0.232855 2.608207
H  -2.940929 -1.081211 1.431661
H  -2.62711 -1.375616 3.164016
C  1.745107 0.631874 2.984204
H  1.852971 0.108388 3.9396
H  2.689711 1.119796 2.734283
H  0.961316 1.390437 3.070147
C  0.793563 -3.692934 2.331449
H  0.373223 -4.54189 2.873806
H  0.80166 -3.925298 1.260034
H  1.820212 -3.521709 2.67104
