program: Gaussian 09
title: Title Card Required
version: EM64L-G09RevD.01
method: RM06
basis: GenECP
operation: Freq
keyword: #N
keyword: Geom=AllCheck
keyword: Guess=TCheck
keyword: SCRF=Check
keyword: GenChk
keyword: RM06/GenECP
keyword: Freq
converged: YES YES YES YES
title: Mulliken charges:
elementType: P Pd P C C C C H C H C H H H C C C C H C H C H H H C C C C H C H C H H H C C C C H C H C H H H C C C C H C H C H H H C C C C H C H C H H H C C C C O C C C C H C H C H H H C H H H C C C C H C H C H H H H
charge: 0.410941 -0.414979 0.426826 -0.057396 -0.178144 -0.181198 -0.146757 0.146878 -0.136489 0.151836 -0.162717 0.154819 0.152633 0.150806 -0.074000 -0.167596 -0.160788 -0.154167 0.154037 -0.149379 0.164779 -0.161426 0.156276 0.152816 0.157489 -0.109954 -0.152631 -0.174957 -0.137002 0.174645 -0.152042 0.166116 -0.163098 0.151482 0.157201 0.155848 -0.077315 -0.160175 -0.167040 -0.149795 0.153213 -0.152593 0.170284 -0.160529 0.158064 0.162866 0.158020 -0.066283 -0.172322 -0.171517 -0.147532 0.157357 -0.134665 0.146730 -0.159974 0.153363 0.147845 0.151394 -0.083041 -0.173103 -0.171536 -0.148383 0.185128 -0.151691 0.156124 -0.159776 0.157645 0.155825 0.155496 0.005555 0.013089 -0.121135 0.321696 -0.504808 0.063244 -0.169204 -0.168013 -0.171247 0.164737 -0.164511 0.183343 -0.145678 0.162682 0.164172 0.162880 -0.582487 0.168013 0.201723 0.164862 0.211626 -0.214241 -0.171169 -0.161938 0.154180 -0.146147 0.165324 -0.150656 0.153638 0.149567 0.154310 0.193803
chargesum: 0.00000
title: Mulliken charges with hydrogens summed into heavy atoms:
elementType: P Pd P C C C C C C C C C C C C C C C C C C C C C C C C C C C C C C C C C C C C C C C C O C C C C C C C C C C C C C
charge: 0.410941 -0.414979 0.426826 -0.057396 -0.031266 -0.029362 0.008062 0.016144 -0.011911 -0.074000 -0.013559 0.003991 0.002109 0.003437 -0.003937 -0.109954 0.022014 -0.008841 0.014481 0.005159 -0.007250 -0.077315 -0.006962 0.003244 0.008268 0.010272 -0.002509 -0.066283 -0.014965 -0.024787 0.005831 0.013180 -0.008579 -0.083041 0.012026 -0.015413 0.009263 0.004134 -0.004281 0.005555 0.013089 0.072669 0.321696 -0.504808 0.063244 -0.004467 0.015330 -0.008565 -0.000339 0.017203 -0.047889 0.211626 -0.060060 -0.005846 -0.008300 0.003419 0.003654
1716.lowfreq: -0.0011 -0.0005 0.0004 3.1904 5.6384 9.2693 14.4569 17.8791 21.8734
redmass: 5.9277 5.2338 6.1280 6.1068 5.6335 5.1868 4.9940 5.1724 5.0386 5.3526 4.5407 4.2620 5.0410 4.7219 5.0432 5.3931 4.2569 5.6848 5.2954 5.5776 5.6086 4.9922 4.2357 3.9344 5.0653 6.4340 6.3959 4.4026 4.7267 4.4721 10.7788 4.7211 4.8384 8.7423 4.8933 5.1447 4.8356 4.9919 4.6893 4.7278 4.7380 4.3412 5.4215 4.9154 3.9442 4.6792 3.0626 3.0072 2.7025 2.4462 4.5107 5.4044 2.9410 2.9800 3.0350 3.2447 4.7662 3.0682 3.3008 3.6840 5.5537 3.8373 6.1371 5.8489 7.1322 5.1084 5.7233 4.5713 4.9753 4.9682 4.1616 4.4055 4.5748 4.7605 5.0037 3.9988 6.3016 6.2172 6.3853 6.3392 6.3383 6.3533 6.3465 6.3964 5.6689 6.5642 6.4260 6.2235 3.7591 1.9236 5.7132 2.0213 4.5211 3.3524 3.5266 1.9502 4.7666 1.7440 2.3935 2.8386 2.6816 4.4113 1.9097 1.7894 1.4679 1.5525 1.4875 1.5923 2.2050 2.2692 6.9124 4.6961 1.2536 1.2819 1.2536 1.2443 1.2426 1.2429 1.2568 1.2471 2.0492 1.3503 1.3438 2.7245 1.3408 1.2890 1.3323 1.3819 1.3251 1.3377 1.3629 1.3526 1.3565 1.3454 1.3100 1.2607 1.3148 1.2808 1.2938 1.3095 1.3112 1.3367 3.7646 5.2225 5.1406 3.8063 5.2266 5.5060 1.4642 4.2698 3.3795 2.8525 1.2422 5.6994 2.5936 1.6722 2.7099 2.5014 2.7581 2.6692 2.9903 2.1775 1.8892 1.2429 2.0972 1.5010 1.5106 1.5361 1.5649 1.5840 1.5230 1.5461 1.5193 2.6659 2.7722 2.7674 2.5870 2.6305 2.6268 1.0783 1.0752 1.0752 1.0787 1.0811 1.0905 1.1000 1.0838 1.8179 1.1234 1.1227 1.1267 1.1230 1.1274 1.1279 1.1578 1.1354 1.5256 2.7829 2.9003 1.4461 1.6393 1.5415 1.5063 1.5962 1.5758 1.6706 2.5314 1.3265 5.3604 3.6555 4.1313 3.5570 4.0790 3.9021 5.9419 5.0523 1.3779 4.0823 2.3205 2.3033 2.2994 2.3036 2.3001 2.3137 1.1205 2.2337 2.3764 1.1841 2.2468 2.1969 2.1981 2.1672 2.1627 1.9813 2.9024 2.4542 6.1328 6.0281 5.8448 5.9316 5.9276 5.9614 5.9391 6.2207 6.1115 5.9745 6.0724 6.1349 5.9671 5.9560 6.0432 6.1489 6.1708 1.0391 1.0843 1.0978 1.1011 1.0881 1.0890 1.0888 1.0854 1.0896 1.0845 1.0871 1.0853 1.0866 1.0855 1.0853 1.0851 1.0862 1.0854 1.0884 1.0852 1.0910 1.0905 1.0906 1.0906 1.0895 1.0890 1.0945 1.0941 1.0937 1.0933 1.0929 1.0941 1.0938 1.0899 1.0988 1.0987 1.0986 1.0984 1.0984 1.0985 1.0986 1.0954 1.0936 1.0943
irintensity: 0.1457 0.0578 0.1056 0.1058 0.0852 0.1956 0.0245 0.1339 0.0554 0.0689 0.0530 0.0313 0.6926 0.0318 0.1090 0.2628 0.1719 0.6067 0.1135 0.7234 1.1622 0.4064 0.4445 0.0747 0.0290 0.8504 1.8124 0.1696 0.6244 0.0233 1.3974 1.5681 0.6349 3.3479 4.6334 0.3095 1.2511 1.3781 0.6325 0.6417 0.3996 0.8467 0.6395 0.2331 1.3564 2.1560 4.4115 0.4351 0.8342 1.1023 0.1981 9.3018 0.4775 0.9146 1.2593 7.2462 20.5811 1.7522 1.2434 11.0822 3.8198 2.9356 13.4904 19.7920 18.7156 3.5851 6.7478 16.8517 29.8270 42.1015 32.3893 74.4115 19.3231 52.8421 74.6526 8.9996 1.0231 0.4947 0.2940 0.4948 0.6029 0.1701 0.3808 0.3131 10.6388 12.2358 5.2264 12.6772 3.3881 32.6501 4.1508 26.8809 8.2309 3.9017 26.2613 36.2459 7.1570 39.3331 17.5774 26.2115 16.9852 1.2231 16.5427 6.1434 14.0751 11.1163 19.3549 15.7717 19.7591 15.2282 13.8944 6.4196 0.3369 0.0271 1.7767 0.4463 1.9461 0.6363 0.8874 0.6214 15.5877 3.4258 0.1252 18.1109 0.4003 1.2143 2.1689 1.0218 0.6814 0.1922 0.4581 0.3728 1.1810 0.6993 1.2201 0.8813 6.7438 1.4209 0.0489 2.2077 0.3975 1.6376 7.2759 7.4931 4.2405 2.2165 2.7576 1.8192 0.2134 16.4047 43.6485 42.6537 1.2998 6.0002 2.0782 1.9879 1.8611 1.9926 1.4315 0.7557 0.6648 0.7057 6.3827 3.2301 21.0348 0.1009 0.4573 0.6948 1.5453 1.0011 3.3265 1.7170 33.0291 6.3788 30.1126 33.1174 17.0745 22.3353 4.1403 0.1488 0.4427 0.1443 0.1932 0.4771 4.1969 8.3829 0.3265 108.7720 5.0097 7.9294 4.3134 5.6705 3.8153 1.2594 5.2280 3.9615 25.5268 105.3863 17.2284 3.9399 6.7171 8.4654 1.9696 4.1915 1.9987 80.1638 360.1099 4.2826 0.8577 2.0872 1.8756 1.2460 0.6047 0.3058 6.2039 6.1106 49.3199 90.8072 10.0223 11.0580 8.9946 23.6142 12.2583 16.8985 24.5650 26.1697 5.5464 16.0517 5.5777 9.2752 4.6009 8.2289 12.0103 5.5297 96.0630 11.2182 196.3811 2.1004 0.9825 0.8353 3.0805 1.4390 0.4359 11.0157 0.1165 6.8291 0.7050 0.4197 1.6126 6.5675 2.2537 1.2001 4.8673 20.4695 6.8257 16.0755 21.6323 1.9169 1.7858 0.3365 5.0828 0.7652 3.1091 1.5432 6.1983 0.0726 1.5292 0.0645 0.7071 0.3169 0.1000 0.8330 0.7296 8.6786 12.5871 3.1537 6.8529 1.8033 6.6941 29.6135 19.1885 26.0165 19.6328 10.7633 27.3338 25.8536 13.7604 36.2364 43.8221 66.1046 23.9554 28.8842 20.2153 78.9165 29.8586 8.9780 7.1143
temp: 298.150 k
press: 1.00000 atm
elementType: 15 46 15 6 6 6 6 1 6 1 6 1 1 1 6 6 6 6 1 6 1 6 1 1 1 6 6 6 6 1 6 1 6 1 1 1 6 6 6 6 1 6 1 6 1 1 1 6 6 6 6 1 6 1 6 1 1 1 6 6 6 6 1 6 1 6 1 1 1 6 6 6 6 8 6 6 6 6 1 6 1 6 1 1 1 6 1 1 1 6 6 6 6 1 6 1 6 1 1 1 1
symmnumber: 1
zpe: 2126347.6 jmol-1
zpe.correction: 0.809883 hartree
zpe.thermalcorrener: 0.860594 hartree
zpe.thermalcorrenthalpy: 0.861539 hartree
zpe.thermalcorrgfe: 0.721156 hartree
zpe.sumelectzpe: -2928.272804 hartree
zpe.sumelectthermal: -2928.222093 hartree
zpe.sumelectthermalent: -2928.221149 hartree
zpe.sumelectthermalfe: -2928.361531 hartree
dipole: 0.2474 -0.4538 0.9665
dipole: 1.0960
quadrupole: -320.5255 -332.5755 -329.6603
quadrupole: 6.8252 5.6899 6.6220
quadrupole: 7.0616 -4.9884 -2.0732 6.8252 5.6899 6.6220
hfenergy: -2929.0826873 hartree
pointgroup: C01 [X(C53H44O1P2Pd1)]
dipole: 0.0697029 -0.1954935 0.3779741 debye
polarizability: 877.5605385|41.0579428|610.2409651|14.9780816|38.025557|595.4279879 unknown
InChI: InChI=1S/2C18H15P.C17H14O.Pd/c2*1-4-10-16(11-5-1)19(17-12-6-2-7-13-17)18-14-8-3-9-15-18;1-13-12-16(14-8-4-2-5-9-14)18-17(13)15-10-6-3-7-11-15;/h2*1-15H;2-11,16H,1H3;
charge 0 multiplicity 1
101 atoms
P  -1.63044107 1.97108034 -0.49720501
Pd 0.10471592 0.35523626 -0.33918246
P  -1.03239986 -1.59488916 0.48610984
C  -2.67727577 -1.59638833 1.32089077
C  -3.83888228 -1.50807526 0.54128766
C  -2.80622068 -1.60067102 2.71164388
C  -5.09336312 -1.47225514 1.13777757
H  -3.76246316 -1.48034983 -0.54726436
C  -4.06284367 -1.54868581 3.30863472
H  -1.91786193 -1.66420489 3.33976499
C  -5.20985845 -1.49687898 2.52536048
H  -5.98479093 -1.41954072 0.51362893
H  -4.1424432 -1.55820046 4.39498467
H  -6.19307846 -1.4680744 2.99331944
C  0.05534469 -2.35935261 1.76231785
C  0.35750435 -3.72072117 1.82279427
C  0.67049417 -1.48995413 2.6719847
C  1.26416178 -4.20095969 2.76615086
H  -0.10119614 -4.41112596 1.11495722
C  1.5590722 -1.97122034 3.62567048
H  0.45625154 -0.41965567 2.60699606
C  1.86567586 -3.33014301 3.66796908
H  1.50078297 -5.26416664 2.79364546
H  2.02491668 -1.28352717 4.33080277
H  2.57573479 -3.70784709 4.40211776
C  -1.2561974 -2.9411877 -0.74742129
C  -0.53376317 -2.85283229 -1.94019809
C  -2.09808071 -4.04262996 -0.54576497
C  -0.6519988 -3.83907942 -2.91564025
H  0.1371103 -2.00367498 -2.09190619
C  -2.21336662 -5.02907119 -1.51858042
H  -2.67101923 -4.12392899 0.37875912
C  -1.49269164 -4.92651029 -2.70678953
H  -0.076448 -3.75500317 -3.83672037
H  -2.87122225 -5.88061121 -1.34949374
H  -1.59036941 -5.69714705 -3.47037389
C  -2.89863789 1.7604849 -1.81468328
C  -3.78822787 2.76485621 -2.20987692
C  -2.96239106 0.51678917 -2.45013951
C  -4.73194551 2.52219039 -3.20210012
H  -3.73871005 3.74885273 -1.74226031
C  -3.90885013 0.27050783 -3.44032112
H  -2.24655885 -0.25823276 -2.16679395
C  -4.79649474 1.27344716 -3.81596702
H  -5.41830521 3.31323213 -3.50117159
H  -3.94251085 -0.70425594 -3.92504148
H  -5.53475838 1.08673418 -4.59455592
C  -2.61278714 2.06571008 1.05364857
C  -1.89995511 2.28317809 2.24102384
C  -3.9947351 1.89081265 1.12292025
C  -2.55687342 2.34976239 3.46232925
H  -0.81578429 2.4084409 2.19812933
C  -4.65191033 1.94628742 2.35051247
H  -4.56676559 1.70006725 0.21462551
C  -3.93893019 2.18115449 3.51949927
H  -1.98915498 2.53164653 4.3740592
H  -5.73066899 1.79837999 2.38858223
H  -4.45640439 2.22614087 4.47678365
C  -1.13044814 3.73486627 -0.70279573
C  0.04286634 3.99342582 -1.4160998
C  -1.86248757 4.81089802 -0.18858278
C  0.46109757 5.30110256 -1.64001303
H  0.63437221 3.14899415 -1.77668478
C  -1.43996818 6.11843027 -0.40555769
H  -2.76358476 4.62168278 0.39712372
C  -0.28090298 6.36532153 -1.13629887
H  1.37639608 5.49005468 -2.19942417
H  -2.01645396 6.94833508 0.00121416
H  0.04989905 7.38945945 -1.30388262
C  3.03876133 0.99312618 0.44697387
C  2.1233 0.44099819 -0.48701388
C  2.99273735 -0.12929362 -1.55450722
C  4.33364329 0.78177832 -0.00679451
O  4.39090106 0.1484027 -1.17849881
C  5.62464113 1.1647185 0.5533351
C  5.79537518 1.38655082 1.92673265
C  6.73262937 1.29420527 -0.29727295
C  7.03816292 1.74765698 2.43002609
H  4.95776037 1.24618687 2.60628977
C  7.96912328 1.66479062 0.20922518
H  6.60383089 1.10398411 -1.36017078
C  8.12583489 1.89498883 1.57407707
H  7.15988804 1.90856333 3.49981443
H  8.81786352 1.77114416 -0.46417507
H  9.09783629 2.18189548 1.97204191
C  2.62929331 1.75838023 1.663232
H  3.31624337 2.58344158 1.89422356
H  1.63163117 2.182675 1.48511539
H  2.55767863 1.12176885 2.55909046
C  2.88815457 -1.61091372 -1.79376904
C  2.94304858 -2.11197414 -3.09229751
C  2.79151444 -2.50061162 -0.7204071
C  2.90096013 -3.48440529 -3.32425142
H  3.02576289 -1.41826879 -3.92985852
C  2.74924001 -3.86957147 -0.95116019
H  2.73391114 -2.11391641 0.29877297
C  2.80322479 -4.36475403 -2.25265739
H  2.94623483 -3.86471168 -4.34411046
H  2.66253872 -4.55249995 -0.10679893
H  2.76391691 -5.43862948 -2.42959672
H  2.8427217 0.41231505 -2.50147768
